{"text_format":"1","workbook":"xlsx","n_sheets":7,"sheets":["Instructions","Card List","Individual Order Form","Monthly Sales","Monthly Orders","Monthly Inventory","Formulas"],"not_rendered":{"charts":0,"images":0,"macros":1,"external_links":0,"defined_names":8,"comments":0,"pivot_tables":0},"unopened":[],"bounds":{"document_bytes":16777216,"sheet_cells":100000,"rows_first":2000,"rows_last":500,"rows_between":2000,"halvings":0,"cell_chars":16384,"cell_head_chars":4096},"cells_cut":0,"cells_raw":0,"read":"whole","date_system":"1900"}

{"sheet":"Instructions","index":0,"n_rows":100,"n_cols":4,"rows_kept":100,"cut":false,"hidden":false,"merged":[[24,3,24,16],[25,3,25,17],[26,3,26,17],[0,0,0,8],[18,3,18,16],[21,3,21,17],[22,3,22,17],[19,3,19,17],[20,3,20,17]]}
["File Instructions"]
["GENERAL:"]
["1)","Use a new File for each month.  Keep the \"Blank\" file so you can copy and use each month."]
[]
["2)","Save files by month and year date.  For example:  Scrip_March2023"]
[]
[]
[null,"Monthly Sales:",null,"This form is to record each week of sales for the month."]
[null,null,null,"It must tie to the deposit (see form)."]
[null,null,null,"In addition, the form tracks all IOUs and the IOU balances."]
[]
[null,"Monthly Orders:",null,"This sheet is to track the monthly cards ordered and costs."]
[null,null,null,"Each order should tie to the order form from the scrip company."]
[]
[null,"Monthly Inventory:",null,"This sheet is to tracks the iventory of cards on hand."]
[]
["INSTRUCTIONS FOR EACH FORM:"]
[]
["Individual Order Form:"]
[null,null,"*","This form can be printed for the customers to use for their orders."]
[null,null,"*","Please be sure to total the order (at bottom right) as well as to note the amount paid for the order.  We need to track IOUs so this information is very important."]
[null,null,"*","If a change is needed to any information in blue, you can do this and all the links/formulas on the other tabs will change as well.  To change the X or check mark (use 0 for X and 1 for check mark in the cell)."]
[null,null,"*","If you need to add a new vendor or delete an existing vendor you must take care to change all the tabs and insure all the links/formulas are correct or make a list of what needs to be added or deleted and Dawn will do this for you :)"]
[]
["Monthly Sales"]
[null,null,"*","This form is to track all the monthly sales for the month."]
[null,null,"*","The intent is that for each deposit for the month, the total of orders less any IOUs must tie to the total of each deposit."]
[null,null,"*","Steps:"]
[null,null,null,"1)  Enter month and year at top of page."]
[null,null,null,"2)  Each deposit should be entered in a separate column (5 total columns available) so that we can total the month."]
[]
[]
[]
[]
[]
[]
[]
[]
[]
[]
[]
[]
[]
[]
[]
[]
[]
[]
[]
[]
[]
[]
[]
[]
[]
[]
[]
[]
[]
[]
[]
[]
[]
[]
[]
[]
[]
[]
[]
[]
[]
[]
[]
[]
[]
[]
[]
[]
[]
[]
[]
[]
[]
[]
[]
[]
[]
[]
[]
[]
[]
[]
[]
[]
[]
[]
[]
[]
[]
["LCRDawn"]

{"sheet":"Card List","index":1,"n_rows":89,"n_cols":10,"rows_kept":89,"cut":false,"hidden":false,"merged":[]}
[null,"Retailer","Card Amt.","Profit %"]
[1,"Amazon",25,2.2499999999999999E-2]
[0,"American Eagle",25,0.1]
[0,"Apple iTunes",15,0.05,null,null,null,null,null,"MUST have cursor on column A of row"]
[0,"Applebee's",25,0.08]
[1,"Arby's",10,0.08]
[1,"Barnes & Noble",10,0.08]
[1,"Bath & Body Works",10,0.13]
[0,"Bed Bath & Beyond",25,7.0000000000000007E-2]
[0,"Best Buy",25,0.04]
[1,"BP Oil/Amoco",50,1.4999999999999999E-2]
[0,"Buffalo Wild Wings",25,0.08]
[0,"Burger King",10,0.04]
[0,"Cheddars",25,0.08]
[0,"Cheesecake Factory",25,0.05]
[0,"Chili's/Maggiano's",25,0.11]
[1,"Chipotle",10,0.1]
[1,"Cousin's",10,0.09]
[1,"Cracker Barrel",25,0.08]
[0,"Dairy Queen",10,0.03]
[0,"Denny's",10,7.0000000000000007E-2]
[0,"Disney",25,0.03]
[0,"Domino's",25,0.08]
[1,"Dunkin' ",10,0.03]
[1,"Exxon/Mobil",50,1.4999999999999999E-2]
[1,"Festival Foods",25,0.03]
[1,"Festival Foods",50,0.03]
[0,"Finish Line",25,0.1]
[0,"GameStop",25,0.03]
[0,"Gap",25,0.14000000000000001]
[0,"Gordon Food Service",25,0.04]
[0,"Groupon",25,7.0000000000000007E-2]
[0,"Hardee's",10,0.05]
[1,"Home Depot",25,0.04]
[0,"Jo-Ann Fabric",25,0.06]
[0,"Journeys",25,0.1]
[0,"Instacart",25,0.05]
[1,"Kohl's",25,0.04]
[1,"Kohl's",100,0.04]
[1,"Kwik Trip",25,0.04]
[1,"Kwik Trip",50,0.04]
[1,"Kwik Trip",100,0.04]
[0,"Lowe's",25,0.04]
[1,"Marcus Theatres",25,0.09]
[1,"Marshalls/TJ Maxx",25,7.0000000000000007E-2]
[0,"Maurices",20,7.0000000000000007E-2]
[1,"McDonald's",10,0.02]
[1,"McDonald's",25,0.02]
[0,"Meijer",25,0.03]
[0,"Meijer",50,0.03]
[1,"Menards",25,0.03]
[0,"Michael's",25,0.04]
[1,"Noodles & Co",10,0.08]
[0,"Old Navy",25,0.14000000000000001]
[1,"Olive Garden",25,0.08]
[1,"Panda Express",25,0.08]
[1,"Panera Bread",10,0.08]
[1,"Panera Bread",25,0.08]
[0,"Papa John's",10,0.08]
[0,"Papa Murphy's",10,0.08]
[1,"Piggly Wiggly",25,0.03]
[1,"Piggly Wiggly",50,0.03]
[1,"Piggly Wiggly",100,0.03]
[0,"Pizza Hut",10,0.08]
[0,"Potbelly",10,0.08]
[0,"Qdoba",25,7.0000000000000007E-2]
[0,"Red Lobster",25,0.08]
[0,"Red Robin",25,0.08]
[1,"Roundy's",25,0.04]
[1,"Roundy's",50,0.04]
[1,"Roundy's",100,0.04]
[0,"Shell ",25,1.4999999999999999E-2]
[1,"Speedway",25,0.04]
[1,"Speedway",50,0.04]
[1,"Speedway",100,0.04]
[1,"Starbucks",10,7.0000000000000007E-2]
[1,"Starbucks",25,7.0000000000000007E-2]
[1,"Subway",10,0.06]
[1,"Taco Bell",10,0.05]
[1,"Target",25,2.5000000000000001E-2]
[0,"Texas Roadhouse",25,0.08]
[1,"TJ Maxx/Home Goods",25,7.0000000000000007E-2]
[1,"Ulta",25,0.04]
[0,"Walgreens",25,0.05]
[1,"Walgreens",100,0.05]
[1,"Walmart",25,2.5000000000000001E-2]
[1,"Walmart",100,2.5000000000000001E-2]
[]
[0,"Wendy's",10,0.04]

{"sheet":"Individual Order Form","index":2,"n_rows":56,"n_cols":14,"rows_kept":56,"cut":false,"hidden":false,"merged":[[40,6,40,7],[53,6,54,9],[53,10,54,11],[55,6,56,9],[55,10,56,11]]}
[null,"Retailer","Card Amt.","Profit %","Quantity","Cost",null,"Retailer","Card Amt.","Profit %","Quanity","Cost"]
[{"$f":"IF(+'Card List'!$A2=\"\",\"\",+'Card List'!$A2)","v":1},{"$f":"IF(+'Card List'!$B2=\"\",\"\",+'Card List'!$B2)","v":"Amazon"},{"$f":"IF(+'Card List'!$C2=\"\",\"\",+'Card List'!$C2)","v":25},{"$f":"IF('Card List'!$D2=\"\",\"\",'Card List'!$D2)","v":2.2499999999999999E-2},null,null,{"$f":"IF(+'Card List'!$A56=\"\",\"\",+'Card List'!$A56)","v":1},{"$f":"IF(+'Card List'!$B56=\"\",\"\",+'Card List'!$B56)","v":"Panda Express"},{"$f":"IF(+'Card List'!$C56=\"\",\"\",+'Card List'!$C56)","v":25},{"$f":"IF('Card List'!$D56=\"\",\"\",'Card List'!$D56)","v":0.08},null,null,null,{"$f":"+IF(RIGHT('Card List'!D2,2)=0,LEFT('Card List'!D2,2),'Card List'!D2)","v":2.2499999999999999E-2}]
[{"$f":"IF(+'Card List'!$A3=\"\",\"\",+'Card List'!$A3)","v":0},{"$f":"IF(+'Card List'!$B3=\"\",\"\",+'Card List'!$B3)","v":"American Eagle"},{"$f":"IF(+'Card List'!$C3=\"\",\"\",+'Card List'!$C3)","v":25},{"$f":"IF('Card List'!$D3=\"\",\"\",'Card List'!$D3)","v":0.1},null,null,{"$f":"IF(+'Card List'!$A57=\"\",\"\",+'Card List'!$A57)","v":1},{"$f":"IF(+'Card List'!$B57=\"\",\"\",+'Card List'!$B57)","v":"Panera Bread"},{"$f":"IF(+'Card List'!$C57=\"\",\"\",+'Card List'!$C57)","v":10},{"$f":"IF('Card List'!$D57=\"\",\"\",'Card List'!$D57)","v":0.08},null,null,null,{"$f":"+IF(RIGHT('Card List'!D3,2)=0,LEFT('Card List'!D3,2),'Card List'!D3)","v":0.1}]
[{"$f":"IF(+'Card List'!$A4=\"\",\"\",+'Card List'!$A4)","v":0},{"$f":"IF(+'Card List'!$B4=\"\",\"\",+'Card List'!$B4)","v":"Apple iTunes"},{"$f":"IF(+'Card List'!$C4=\"\",\"\",+'Card List'!$C4)","v":15},{"$f":"IF('Card List'!$D4=\"\",\"\",'Card List'!$D4)","v":0.05},null,null,{"$f":"IF(+'Card List'!$A58=\"\",\"\",+'Card List'!$A58)","v":1},{"$f":"IF(+'Card List'!$B58=\"\",\"\",+'Card List'!$B58)","v":"Panera Bread"},{"$f":"IF(+'Card List'!$C58=\"\",\"\",+'Card List'!$C58)","v":25},{"$f":"IF('Card List'!$D58=\"\",\"\",'Card List'!$D58)","v":0.08}]
[{"$f":"IF(+'Card List'!$A5=\"\",\"\",+'Card List'!$A5)","v":0},{"$f":"IF(+'Card List'!$B5=\"\",\"\",+'Card List'!$B5)","v":"Applebee's"},{"$f":"IF(+'Card List'!$C5=\"\",\"\",+'Card List'!$C5)","v":25},{"$f":"IF('Card List'!$D5=\"\",\"\",'Card List'!$D5)","v":0.08},null,null,{"$f":"IF(+'Card List'!$A59=\"\",\"\",+'Card List'!$A59)","v":0},{"$f":"IF(+'Card List'!$B59=\"\",\"\",+'Card List'!$B59)","v":"Papa John's"},{"$f":"IF(+'Card List'!$C59=\"\",\"\",+'Card List'!$C59)","v":10},{"$f":"IF('Card List'!$D59=\"\",\"\",'Card List'!$D59)","v":0.08}]
[{"$f":"IF(+'Card List'!$A6=\"\",\"\",+'Card List'!$A6)","v":1},{"$f":"IF(+'Card List'!$B6=\"\",\"\",+'Card List'!$B6)","v":"Arby's"},{"$f":"IF(+'Card List'!$C6=\"\",\"\",+'Card List'!$C6)","v":10},{"$f":"IF('Card List'!$D6=\"\",\"\",'Card List'!$D6)","v":0.08},null,null,{"$f":"IF(+'Card List'!$A60=\"\",\"\",+'Card List'!$A60)","v":0},{"$f":"IF(+'Card List'!$B60=\"\",\"\",+'Card List'!$B60)","v":"Papa Murphy's"},{"$f":"IF(+'Card List'!$C60=\"\",\"\",+'Card List'!$C60)","v":10},{"$f":"IF('Card List'!$D60=\"\",\"\",'Card List'!$D60)","v":0.08},null,null,null,{"$f":"IF(N2=0.0225,P2,CELL(\"format\",N2)=p0)","v":0}]
[{"$f":"IF(+'Card List'!$A7=\"\",\"\",+'Card List'!$A7)","v":1},{"$f":"IF(+'Card List'!$B7=\"\",\"\",+'Card List'!$B7)","v":"Barnes & Noble"},{"$f":"IF(+'Card List'!$C7=\"\",\"\",+'Card List'!$C7)","v":10},{"$f":"IF('Card List'!$D7=\"\",\"\",'Card List'!$D7)","v":0.08},null,null,{"$f":"IF(+'Card List'!$A61=\"\",\"\",+'Card List'!$A61)","v":1},{"$f":"IF(+'Card List'!$B61=\"\",\"\",+'Card List'!$B61)","v":"Piggly Wiggly"},{"$f":"IF(+'Card List'!$C61=\"\",\"\",+'Card List'!$C61)","v":25},{"$f":"IF('Card List'!$D61=\"\",\"\",'Card List'!$D61)","v":0.03}]
[{"$f":"IF(+'Card List'!$A8=\"\",\"\",+'Card List'!$A8)","v":1},{"$f":"IF(+'Card List'!$B8=\"\",\"\",+'Card List'!$B8)","v":"Bath & Body Works"},{"$f":"IF(+'Card List'!$C8=\"\",\"\",+'Card List'!$C8)","v":10},{"$f":"IF('Card List'!$D8=\"\",\"\",'Card List'!$D8)","v":0.13},null,null,{"$f":"IF(+'Card List'!$A62=\"\",\"\",+'Card List'!$A62)","v":1},{"$f":"IF(+'Card List'!$B62=\"\",\"\",+'Card List'!$B62)","v":"Piggly Wiggly"},{"$f":"IF(+'Card List'!$C62=\"\",\"\",+'Card List'!$C62)","v":50},{"$f":"IF('Card List'!$D62=\"\",\"\",'Card List'!$D62)","v":0.03}]
[{"$f":"IF(+'Card List'!$A9=\"\",\"\",+'Card List'!$A9)","v":0},{"$f":"IF(+'Card List'!$B9=\"\",\"\",+'Card List'!$B9)","v":"Bed Bath & Beyond"},{"$f":"IF(+'Card List'!$C9=\"\",\"\",+'Card List'!$C9)","v":25},{"$f":"IF('Card List'!$D9=\"\",\"\",'Card List'!$D9)","v":7.0000000000000007E-2},null,null,{"$f":"IF(+'Card List'!$A63=\"\",\"\",+'Card List'!$A63)","v":1},{"$f":"IF(+'Card List'!$B63=\"\",\"\",+'Card List'!$B63)","v":"Piggly Wiggly"},{"$f":"IF(+'Card List'!$C63=\"\",\"\",+'Card List'!$C63)","v":100},{"$f":"IF('Card List'!$D63=\"\",\"\",'Card List'!$D63)","v":0.03}]
[{"$f":"IF(+'Card List'!$A10=\"\",\"\",+'Card List'!$A10)","v":0},{"$f":"IF(+'Card List'!$B10=\"\",\"\",+'Card List'!$B10)","v":"Best Buy"},{"$f":"IF(+'Card List'!$C10=\"\",\"\",+'Card List'!$C10)","v":25},{"$f":"IF('Card List'!$D10=\"\",\"\",'Card List'!$D10)","v":0.04},null,null,{"$f":"IF(+'Card List'!$A64=\"\",\"\",+'Card List'!$A64)","v":0},{"$f":"IF(+'Card List'!$B64=\"\",\"\",+'Card List'!$B64)","v":"Pizza Hut"},{"$f":"IF(+'Card List'!$C64=\"\",\"\",+'Card List'!$C64)","v":10},{"$f":"IF('Card List'!$D64=\"\",\"\",'Card List'!$D64)","v":0.08}]
[{"$f":"IF(+'Card List'!$A11=\"\",\"\",+'Card List'!$A11)","v":1},{"$f":"IF(+'Card List'!$B11=\"\",\"\",+'Card List'!$B11)","v":"BP Oil/Amoco"},{"$f":"IF(+'Card List'!$C11=\"\",\"\",+'Card List'!$C11)","v":50},{"$f":"IF('Card List'!$D11=\"\",\"\",'Card List'!$D11)","v":1.4999999999999999E-2},null,null,{"$f":"IF(+'Card List'!$A65=\"\",\"\",+'Card List'!$A65)","v":0},{"$f":"IF(+'Card List'!$B65=\"\",\"\",+'Card List'!$B65)","v":"Potbelly"},{"$f":"IF(+'Card List'!$C65=\"\",\"\",+'Card List'!$C65)","v":10},{"$f":"IF('Card List'!$D65=\"\",\"\",'Card List'!$D65)","v":0.08}]
[{"$f":"IF(+'Card List'!$A12=\"\",\"\",+'Card List'!$A12)","v":0},{"$f":"IF(+'Card List'!$B12=\"\",\"\",+'Card List'!$B12)","v":"Buffalo Wild Wings"},{"$f":"IF(+'Card List'!$C12=\"\",\"\",+'Card List'!$C12)","v":25},{"$f":"IF('Card List'!$D12=\"\",\"\",'Card List'!$D12)","v":0.08},null,null,{"$f":"IF(+'Card List'!$A66=\"\",\"\",+'Card List'!$A66)","v":0},{"$f":"IF(+'Card List'!$B66=\"\",\"\",+'Card List'!$B66)","v":"Qdoba"},{"$f":"IF(+'Card List'!$C66=\"\",\"\",+'Card List'!$C66)","v":25},{"$f":"IF('Card List'!$D66=\"\",\"\",'Card List'!$D66)","v":7.0000000000000007E-2}]
[{"$f":"IF(+'Card List'!$A13=\"\",\"\",+'Card List'!$A13)","v":0},{"$f":"IF(+'Card List'!$B13=\"\",\"\",+'Card List'!$B13)","v":"Burger King"},{"$f":"IF(+'Card List'!$C13=\"\",\"\",+'Card List'!$C13)","v":10},{"$f":"IF('Card List'!$D13=\"\",\"\",'Card List'!$D13)","v":0.04},null,null,{"$f":"IF(+'Card List'!$A67=\"\",\"\",+'Card List'!$A67)","v":0},{"$f":"IF(+'Card List'!$B67=\"\",\"\",+'Card List'!$B67)","v":"Red Lobster"},{"$f":"IF(+'Card List'!$C67=\"\",\"\",+'Card List'!$C67)","v":25},{"$f":"IF('Card List'!$D67=\"\",\"\",'Card List'!$D67)","v":0.08}]
[{"$f":"IF(+'Card List'!$A14=\"\",\"\",+'Card List'!$A14)","v":0},{"$f":"IF(+'Card List'!$B14=\"\",\"\",+'Card List'!$B14)","v":"Cheddars"},{"$f":"IF(+'Card List'!$C14=\"\",\"\",+'Card List'!$C14)","v":25},{"$f":"IF('Card List'!$D14=\"\",\"\",'Card List'!$D14)","v":0.08},null,null,{"$f":"IF(+'Card List'!$A68=\"\",\"\",+'Card List'!$A68)","v":0},{"$f":"IF(+'Card List'!$B68=\"\",\"\",+'Card List'!$B68)","v":"Red Robin"},{"$f":"IF(+'Card List'!$C68=\"\",\"\",+'Card List'!$C68)","v":25},{"$f":"IF('Card List'!$D68=\"\",\"\",'Card List'!$D68)","v":0.08}]
[{"$f":"IF(+'Card List'!$A15=\"\",\"\",+'Card List'!$A15)","v":0},{"$f":"IF(+'Card List'!$B15=\"\",\"\",+'Card List'!$B15)","v":"Cheesecake Factory"},{"$f":"IF(+'Card List'!$C15=\"\",\"\",+'Card List'!$C15)","v":25},{"$f":"IF('Card List'!$D15=\"\",\"\",'Card List'!$D15)","v":0.05},null,null,{"$f":"IF(+'Card List'!$A69=\"\",\"\",+'Card List'!$A69)","v":1},{"$f":"IF(+'Card List'!$B69=\"\",\"\",+'Card List'!$B69)","v":"Roundy's"},{"$f":"IF(+'Card List'!$C69=\"\",\"\",+'Card List'!$C69)","v":25},{"$f":"IF('Card List'!$D69=\"\",\"\",'Card List'!$D69)","v":0.04}]
[{"$f":"IF(+'Card List'!$A16=\"\",\"\",+'Card List'!$A16)","v":0},{"$f":"IF(+'Card List'!$B16=\"\",\"\",+'Card List'!$B16)","v":"Chili's/Maggiano's"},{"$f":"IF(+'Card List'!$C16=\"\",\"\",+'Card List'!$C16)","v":25},{"$f":"IF('Card List'!$D16=\"\",\"\",'Card List'!$D16)","v":0.11},null,null,{"$f":"IF(+'Card List'!$A70=\"\",\"\",+'Card List'!$A70)","v":1},{"$f":"IF(+'Card List'!$B70=\"\",\"\",+'Card List'!$B70)","v":"Roundy's"},{"$f":"IF(+'Card List'!$C70=\"\",\"\",+'Card List'!$C70)","v":50},{"$f":"IF('Card List'!$D70=\"\",\"\",'Card List'!$D70)","v":0.04}]
[{"$f":"IF(+'Card List'!$A17=\"\",\"\",+'Card List'!$A17)","v":1},{"$f":"IF(+'Card List'!$B17=\"\",\"\",+'Card List'!$B17)","v":"Chipotle"},{"$f":"IF(+'Card List'!$C17=\"\",\"\",+'Card List'!$C17)","v":10},{"$f":"IF('Card List'!$D17=\"\",\"\",'Card List'!$D17)","v":0.1},null,null,{"$f":"IF(+'Card List'!$A71=\"\",\"\",+'Card List'!$A71)","v":1},{"$f":"IF(+'Card List'!$B71=\"\",\"\",+'Card List'!$B71)","v":"Roundy's"},{"$f":"IF(+'Card List'!$C71=\"\",\"\",+'Card List'!$C71)","v":100},{"$f":"IF('Card List'!$D71=\"\",\"\",'Card List'!$D71)","v":0.04}]
[{"$f":"IF(+'Card List'!$A18=\"\",\"\",+'Card List'!$A18)","v":1},{"$f":"IF(+'Card List'!$B18=\"\",\"\",+'Card List'!$B18)","v":"Cousin's"},{"$f":"IF(+'Card List'!$C18=\"\",\"\",+'Card List'!$C18)","v":10},{"$f":"IF('Card List'!$D18=\"\",\"\",'Card List'!$D18)","v":0.09},null,null,{"$f":"IF(+'Card List'!$A72=\"\",\"\",+'Card List'!$A72)","v":0},{"$f":"IF(+'Card List'!$B72=\"\",\"\",+'Card List'!$B72)","v":"Shell "},{"$f":"IF(+'Card List'!$C72=\"\",\"\",+'Card List'!$C72)","v":25},{"$f":"IF('Card List'!$D72=\"\",\"\",'Card List'!$D72)","v":1.4999999999999999E-2}]
[{"$f":"IF(+'Card List'!$A19=\"\",\"\",+'Card List'!$A19)","v":1},{"$f":"IF(+'Card List'!$B19=\"\",\"\",+'Card List'!$B19)","v":"Cracker Barrel"},{"$f":"IF(+'Card List'!$C19=\"\",\"\",+'Card List'!$C19)","v":25},{"$f":"IF('Card List'!$D19=\"\",\"\",'Card List'!$D19)","v":0.08},null,null,{"$f":"IF(+'Card List'!$A73=\"\",\"\",+'Card List'!$A73)","v":1},{"$f":"IF(+'Card List'!$B73=\"\",\"\",+'Card List'!$B73)","v":"Speedway"},{"$f":"IF(+'Card List'!$C73=\"\",\"\",+'Card List'!$C73)","v":25},{"$f":"IF('Card List'!$D73=\"\",\"\",'Card List'!$D73)","v":0.04}]
[{"$f":"IF(+'Card List'!$A20=\"\",\"\",+'Card List'!$A20)","v":0},{"$f":"IF(+'Card List'!$B20=\"\",\"\",+'Card List'!$B20)","v":"Dairy Queen"},{"$f":"IF(+'Card List'!$C20=\"\",\"\",+'Card List'!$C20)","v":10},{"$f":"IF('Card List'!$D20=\"\",\"\",'Card List'!$D20)","v":0.03},null,null,{"$f":"IF(+'Card List'!$A74=\"\",\"\",+'Card List'!$A74)","v":1},{"$f":"IF(+'Card List'!$B74=\"\",\"\",+'Card List'!$B74)","v":"Speedway"},{"$f":"IF(+'Card List'!$C74=\"\",\"\",+'Card List'!$C74)","v":50},{"$f":"IF('Card List'!$D74=\"\",\"\",'Card List'!$D74)","v":0.04}]
[{"$f":"IF(+'Card List'!$A21=\"\",\"\",+'Card List'!$A21)","v":0},{"$f":"IF(+'Card List'!$B21=\"\",\"\",+'Card List'!$B21)","v":"Denny's"},{"$f":"IF(+'Card List'!$C21=\"\",\"\",+'Card List'!$C21)","v":10},{"$f":"IF('Card List'!$D21=\"\",\"\",'Card List'!$D21)","v":7.0000000000000007E-2},null,null,{"$f":"IF(+'Card List'!$A75=\"\",\"\",+'Card List'!$A75)","v":1},{"$f":"IF(+'Card List'!$B75=\"\",\"\",+'Card List'!$B75)","v":"Speedway"},{"$f":"IF(+'Card List'!$C75=\"\",\"\",+'Card List'!$C75)","v":100},{"$f":"IF('Card List'!$D75=\"\",\"\",'Card List'!$D75)","v":0.04}]
[{"$f":"IF(+'Card List'!$A22=\"\",\"\",+'Card List'!$A22)","v":0},{"$f":"IF(+'Card List'!$B22=\"\",\"\",+'Card List'!$B22)","v":"Disney"},{"$f":"IF(+'Card List'!$C22=\"\",\"\",+'Card List'!$C22)","v":25},{"$f":"IF('Card List'!$D22=\"\",\"\",'Card List'!$D22)","v":0.03},null,null,{"$f":"IF(+'Card List'!$A76=\"\",\"\",+'Card List'!$A76)","v":1},{"$f":"IF(+'Card List'!$B76=\"\",\"\",+'Card List'!$B76)","v":"Starbucks"},{"$f":"IF(+'Card List'!$C76=\"\",\"\",+'Card List'!$C76)","v":10},{"$f":"IF('Card List'!$D76=\"\",\"\",'Card List'!$D76)","v":7.0000000000000007E-2}]
[{"$f":"IF(+'Card List'!$A23=\"\",\"\",+'Card List'!$A23)","v":0},{"$f":"IF(+'Card List'!$B23=\"\",\"\",+'Card List'!$B23)","v":"Domino's"},{"$f":"IF(+'Card List'!$C23=\"\",\"\",+'Card List'!$C23)","v":25},{"$f":"IF('Card List'!$D23=\"\",\"\",'Card List'!$D23)","v":0.08},null,null,{"$f":"IF(+'Card List'!$A77=\"\",\"\",+'Card List'!$A77)","v":1},{"$f":"IF(+'Card List'!$B77=\"\",\"\",+'Card List'!$B77)","v":"Starbucks"},{"$f":"IF(+'Card List'!$C77=\"\",\"\",+'Card List'!$C77)","v":25},{"$f":"IF('Card List'!$D77=\"\",\"\",'Card List'!$D77)","v":7.0000000000000007E-2}]
[{"$f":"IF(+'Card List'!$A24=\"\",\"\",+'Card List'!$A24)","v":1},{"$f":"IF(+'Card List'!$B24=\"\",\"\",+'Card List'!$B24)","v":"Dunkin' "},{"$f":"IF(+'Card List'!$C24=\"\",\"\",+'Card List'!$C24)","v":10},{"$f":"IF('Card List'!$D24=\"\",\"\",'Card List'!$D24)","v":0.03},null,null,{"$f":"IF(+'Card List'!$A78=\"\",\"\",+'Card List'!$A78)","v":1},{"$f":"IF(+'Card List'!$B78=\"\",\"\",+'Card List'!$B78)","v":"Subway"},{"$f":"IF(+'Card List'!$C78=\"\",\"\",+'Card List'!$C78)","v":10},{"$f":"IF('Card List'!$D78=\"\",\"\",'Card List'!$D78)","v":0.06}]
[{"$f":"IF(+'Card List'!$A25=\"\",\"\",+'Card List'!$A25)","v":1},{"$f":"IF(+'Card List'!$B25=\"\",\"\",+'Card List'!$B25)","v":"Exxon/Mobil"},{"$f":"IF(+'Card List'!$C25=\"\",\"\",+'Card List'!$C25)","v":50},{"$f":"IF('Card List'!$D25=\"\",\"\",'Card List'!$D25)","v":1.4999999999999999E-2},null,null,{"$f":"IF(+'Card List'!$A79=\"\",\"\",+'Card List'!$A79)","v":1},{"$f":"IF(+'Card List'!$B79=\"\",\"\",+'Card List'!$B79)","v":"Taco Bell"},{"$f":"IF(+'Card List'!$C79=\"\",\"\",+'Card List'!$C79)","v":10},{"$f":"IF('Card List'!$D79=\"\",\"\",'Card List'!$D79)","v":0.05}]
[{"$f":"IF(+'Card List'!$A26=\"\",\"\",+'Card List'!$A26)","v":1},{"$f":"IF(+'Card List'!$B26=\"\",\"\",+'Card List'!$B26)","v":"Festival Foods"},{"$f":"IF(+'Card List'!$C26=\"\",\"\",+'Card List'!$C26)","v":25},{"$f":"IF('Card List'!$D26=\"\",\"\",'Card List'!$D26)","v":0.03},null,null,{"$f":"IF(+'Card List'!$A80=\"\",\"\",+'Card List'!$A80)","v":1},{"$f":"IF(+'Card List'!$B80=\"\",\"\",+'Card List'!$B80)","v":"Target"},{"$f":"IF(+'Card List'!$C80=\"\",\"\",+'Card List'!$C80)","v":25},{"$f":"IF('Card List'!$D80=\"\",\"\",'Card List'!$D80)","v":2.5000000000000001E-2}]
[{"$f":"IF(+'Card List'!$A27=\"\",\"\",+'Card List'!$A27)","v":1},{"$f":"IF(+'Card List'!$B27=\"\",\"\",+'Card List'!$B27)","v":"Festival Foods"},{"$f":"IF(+'Card List'!$C27=\"\",\"\",+'Card List'!$C27)","v":50},{"$f":"IF('Card List'!$D27=\"\",\"\",'Card List'!$D27)","v":0.03},null,null,{"$f":"IF(+'Card List'!$A81=\"\",\"\",+'Card List'!$A81)","v":0},{"$f":"IF(+'Card List'!$B81=\"\",\"\",+'Card List'!$B81)","v":"Texas Roadhouse"},{"$f":"IF(+'Card List'!$C81=\"\",\"\",+'Card List'!$C81)","v":25},{"$f":"IF('Card List'!$D81=\"\",\"\",'Card List'!$D81)","v":0.08}]
[{"$f":"IF(+'Card List'!$A28=\"\",\"\",+'Card List'!$A28)","v":0},{"$f":"IF(+'Card List'!$B28=\"\",\"\",+'Card List'!$B28)","v":"Finish Line"},{"$f":"IF(+'Card List'!$C28=\"\",\"\",+'Card List'!$C28)","v":25},{"$f":"IF('Card List'!$D28=\"\",\"\",'Card List'!$D28)","v":0.1},null,null,{"$f":"IF(+'Card List'!$A82=\"\",\"\",+'Card List'!$A82)","v":1},{"$f":"IF(+'Card List'!$B82=\"\",\"\",+'Card List'!$B82)","v":"TJ Maxx/Home Goods"},{"$f":"IF(+'Card List'!$C82=\"\",\"\",+'Card List'!$C82)","v":25},{"$f":"IF('Card List'!$D82=\"\",\"\",'Card List'!$D82)","v":7.0000000000000007E-2}]
[{"$f":"IF(+'Card List'!$A29=\"\",\"\",+'Card List'!$A29)","v":0},{"$f":"IF(+'Card List'!$B29=\"\",\"\",+'Card List'!$B29)","v":"GameStop"},{"$f":"IF(+'Card List'!$C29=\"\",\"\",+'Card List'!$C29)","v":25},{"$f":"IF('Card List'!$D29=\"\",\"\",'Card List'!$D29)","v":0.03},null,null,{"$f":"IF(+'Card List'!$A83=\"\",\"\",+'Card List'!$A83)","v":1},{"$f":"IF(+'Card List'!$B83=\"\",\"\",+'Card List'!$B83)","v":"Ulta"},{"$f":"IF(+'Card List'!$C83=\"\",\"\",+'Card List'!$C83)","v":25},{"$f":"IF('Card List'!$D83=\"\",\"\",'Card List'!$D83)","v":0.04}]
[{"$f":"IF(+'Card List'!$A30=\"\",\"\",+'Card List'!$A30)","v":0},{"$f":"IF(+'Card List'!$B30=\"\",\"\",+'Card List'!$B30)","v":"Gap"},{"$f":"IF(+'Card List'!$C30=\"\",\"\",+'Card List'!$C30)","v":25},{"$f":"IF('Card List'!$D30=\"\",\"\",'Card List'!$D30)","v":0.14000000000000001},null,null,{"$f":"IF(+'Card List'!$A84=\"\",\"\",+'Card List'!$A84)","v":0},{"$f":"IF(+'Card List'!$B84=\"\",\"\",+'Card List'!$B84)","v":"Walgreens"},{"$f":"IF(+'Card List'!$C84=\"\",\"\",+'Card List'!$C84)","v":25},{"$f":"IF('Card List'!$D84=\"\",\"\",'Card List'!$D84)","v":0.05}]
[{"$f":"IF(+'Card List'!$A31=\"\",\"\",+'Card List'!$A31)","v":0},{"$f":"IF(+'Card List'!$B31=\"\",\"\",+'Card List'!$B31)","v":"Gordon Food Service"},{"$f":"IF(+'Card List'!$C31=\"\",\"\",+'Card List'!$C31)","v":25},{"$f":"IF('Card List'!$D31=\"\",\"\",'Card List'!$D31)","v":0.04},null,null,{"$f":"IF(+'Card List'!$A85=\"\",\"\",+'Card List'!$A85)","v":1},{"$f":"IF(+'Card List'!$B85=\"\",\"\",+'Card List'!$B85)","v":"Walgreens"},{"$f":"IF(+'Card List'!$C85=\"\",\"\",+'Card List'!$C85)","v":100},{"$f":"IF('Card List'!$D85=\"\",\"\",'Card List'!$D85)","v":0.05}]
[{"$f":"IF(+'Card List'!$A32=\"\",\"\",+'Card List'!$A32)","v":0},{"$f":"IF(+'Card List'!$B32=\"\",\"\",+'Card List'!$B32)","v":"Groupon"},{"$f":"IF(+'Card List'!$C32=\"\",\"\",+'Card List'!$C32)","v":25},{"$f":"IF('Card List'!$D32=\"\",\"\",'Card List'!$D32)","v":7.0000000000000007E-2},null,null,{"$f":"IF(+'Card List'!$A86=\"\",\"\",+'Card List'!$A86)","v":1},{"$f":"IF(+'Card List'!$B86=\"\",\"\",+'Card List'!$B86)","v":"Walmart"},{"$f":"IF(+'Card List'!$C86=\"\",\"\",+'Card List'!$C86)","v":25},{"$f":"IF('Card List'!$D86=\"\",\"\",'Card List'!$D86)","v":2.5000000000000001E-2}]
[{"$f":"IF(+'Card List'!$A33=\"\",\"\",+'Card List'!$A33)","v":0},{"$f":"IF(+'Card List'!$B33=\"\",\"\",+'Card List'!$B33)","v":"Hardee's"},{"$f":"IF(+'Card List'!$C33=\"\",\"\",+'Card List'!$C33)","v":10},{"$f":"IF('Card List'!$D33=\"\",\"\",'Card List'!$D33)","v":0.05},null,null,{"$f":"IF(+'Card List'!$A87=\"\",\"\",+'Card List'!$A87)","v":1},{"$f":"IF(+'Card List'!$B87=\"\",\"\",+'Card List'!$B87)","v":"Walmart"},{"$f":"IF(+'Card List'!$C87=\"\",\"\",+'Card List'!$C87)","v":100},{"$f":"IF('Card List'!$D87=\"\",\"\",'Card List'!$D87)","v":2.5000000000000001E-2}]
[{"$f":"IF(+'Card List'!$A34=\"\",\"\",+'Card List'!$A34)","v":1},{"$f":"IF(+'Card List'!$B34=\"\",\"\",+'Card List'!$B34)","v":"Home Depot"},{"$f":"IF(+'Card List'!$C34=\"\",\"\",+'Card List'!$C34)","v":25},{"$f":"IF('Card List'!$D34=\"\",\"\",'Card List'!$D34)","v":0.04},null,null,{"$f":"IF(+'Card List'!$A88=\"\",\"\",+'Card List'!$A88)","v":""},{"$f":"IF(+'Card List'!$B88=\"\",\"\",+'Card List'!$B88)","v":""},{"$f":"IF(+'Card List'!$C88=\"\",\"\",+'Card List'!$C88)","v":""},{"$f":"IF('Card List'!$D88=\"\",\"\",'Card List'!$D88)","v":""}]
[{"$f":"IF(+'Card List'!$A35=\"\",\"\",+'Card List'!$A35)","v":0},{"$f":"IF(+'Card List'!$B35=\"\",\"\",+'Card List'!$B35)","v":"Jo-Ann Fabric"},{"$f":"IF(+'Card List'!$C35=\"\",\"\",+'Card List'!$C35)","v":25},{"$f":"IF('Card List'!$D35=\"\",\"\",'Card List'!$D35)","v":0.06},null,null,{"$f":"IF(+'Card List'!$A89=\"\",\"\",+'Card List'!$A89)","v":0},{"$f":"IF(+'Card List'!$B89=\"\",\"\",+'Card List'!$B89)","v":"Wendy's"},{"$f":"IF(+'Card List'!$C89=\"\",\"\",+'Card List'!$C89)","v":10},{"$f":"IF('Card List'!$D89=\"\",\"\",'Card List'!$D89)","v":0.04}]
[{"$f":"IF(+'Card List'!$A36=\"\",\"\",+'Card List'!$A36)","v":0},{"$f":"IF(+'Card List'!$B36=\"\",\"\",+'Card List'!$B36)","v":"Journeys"},{"$f":"IF(+'Card List'!$C36=\"\",\"\",+'Card List'!$C36)","v":25},{"$f":"IF('Card List'!$D36=\"\",\"\",'Card List'!$D36)","v":0.1},null,null,{"$f":"IF(+'Card List'!$A90=\"\",\"\",+'Card List'!$A90)","v":""},{"$f":"IF(+'Card List'!$B90=\"\",\"\",+'Card List'!$B90)","v":""},{"$f":"IF(+'Card List'!$C90=\"\",\"\",+'Card List'!$C90)","v":""},{"$f":"IF('Card List'!$D90=\"\",\"\",'Card List'!$D90)","v":""}]
[{"$f":"IF(+'Card List'!$A37=\"\",\"\",+'Card List'!$A37)","v":0},{"$f":"IF(+'Card List'!$B37=\"\",\"\",+'Card List'!$B37)","v":"Instacart"},{"$f":"IF(+'Card List'!$C37=\"\",\"\",+'Card List'!$C37)","v":25},{"$f":"IF('Card List'!$D37=\"\",\"\",'Card List'!$D37)","v":0.05},null,null,{"$f":"IF(+'Card List'!$A91=\"\",\"\",+'Card List'!$A91)","v":""},{"$f":"IF(+'Card List'!$B91=\"\",\"\",+'Card List'!$B91)","v":""},{"$f":"IF(+'Card List'!$C91=\"\",\"\",+'Card List'!$C91)","v":""},{"$f":"IF('Card List'!$D91=\"\",\"\",'Card List'!$D91)","v":""}]
[{"$f":"IF(+'Card List'!$A38=\"\",\"\",+'Card List'!$A38)","v":1},{"$f":"IF(+'Card List'!$B38=\"\",\"\",+'Card List'!$B38)","v":"Kohl's"},{"$f":"IF(+'Card List'!$C38=\"\",\"\",+'Card List'!$C38)","v":25},{"$f":"IF('Card List'!$D38=\"\",\"\",'Card List'!$D38)","v":0.04},null,null,{"$f":"IF(+'Card List'!$A92=\"\",\"\",+'Card List'!$A92)","v":""},{"$f":"IF(+'Card List'!$B92=\"\",\"\",+'Card List'!$B92)","v":""},{"$f":"IF(+'Card List'!$C92=\"\",\"\",+'Card List'!$C92)","v":""},{"$f":"IF('Card List'!$D92=\"\",\"\",'Card List'!$D92)","v":""}]
[{"$f":"IF(+'Card List'!$A39=\"\",\"\",+'Card List'!$A39)","v":1},{"$f":"IF(+'Card List'!$B39=\"\",\"\",+'Card List'!$B39)","v":"Kohl's"},{"$f":"IF(+'Card List'!$C39=\"\",\"\",+'Card List'!$C39)","v":100},{"$f":"IF('Card List'!$D39=\"\",\"\",'Card List'!$D39)","v":0.04},null,null,{"$f":"IF(+'Card List'!$A93=\"\",\"\",+'Card List'!$A93)","v":""},{"$f":"IF(+'Card List'!$B93=\"\",\"\",+'Card List'!$B93)","v":""},{"$f":"IF(+'Card List'!$C93=\"\",\"\",+'Card List'!$C93)","v":""},{"$f":"IF('Card List'!$D93=\"\",\"\",'Card List'!$D93)","v":""}]
[{"$f":"IF(+'Card List'!$A40=\"\",\"\",+'Card List'!$A40)","v":1},{"$f":"IF(+'Card List'!$B40=\"\",\"\",+'Card List'!$B40)","v":"Kwik Trip"},{"$f":"IF(+'Card List'!$C40=\"\",\"\",+'Card List'!$C40)","v":25},{"$f":"IF('Card List'!$D40=\"\",\"\",'Card List'!$D40)","v":0.04}]
[{"$f":"IF(+'Card List'!$A41=\"\",\"\",+'Card List'!$A41)","v":1},{"$f":"IF(+'Card List'!$B41=\"\",\"\",+'Card List'!$B41)","v":"Kwik Trip"},{"$f":"IF(+'Card List'!$C41=\"\",\"\",+'Card List'!$C41)","v":50},{"$f":"IF('Card List'!$D41=\"\",\"\",'Card List'!$D41)","v":0.04},null,null,"Other Vendors",null,"Card Amt.","Profit %","Quantity","Cost"]
[{"$f":"IF(+'Card List'!$A42=\"\",\"\",+'Card List'!$A42)","v":1},{"$f":"IF(+'Card List'!$B42=\"\",\"\",+'Card List'!$B42)","v":"Kwik Trip"},{"$f":"IF(+'Card List'!$C42=\"\",\"\",+'Card List'!$C42)","v":100},{"$f":"IF('Card List'!$D42=\"\",\"\",'Card List'!$D42)","v":0.04}]
[{"$f":"IF(+'Card List'!$A43=\"\",\"\",+'Card List'!$A43)","v":0},{"$f":"IF(+'Card List'!$B43=\"\",\"\",+'Card List'!$B43)","v":"Lowe's"},{"$f":"IF(+'Card List'!$C43=\"\",\"\",+'Card List'!$C43)","v":25},{"$f":"IF('Card List'!$D43=\"\",\"\",'Card List'!$D43)","v":0.04}]
[{"$f":"IF(+'Card List'!$A44=\"\",\"\",+'Card List'!$A44)","v":1},{"$f":"IF(+'Card List'!$B44=\"\",\"\",+'Card List'!$B44)","v":"Marcus Theatres"},{"$f":"IF(+'Card List'!$C44=\"\",\"\",+'Card List'!$C44)","v":25},{"$f":"IF('Card List'!$D44=\"\",\"\",'Card List'!$D44)","v":0.09}]
[{"$f":"IF(+'Card List'!$A45=\"\",\"\",+'Card List'!$A45)","v":1},{"$f":"IF(+'Card List'!$B45=\"\",\"\",+'Card List'!$B45)","v":"Marshalls/TJ Maxx"},{"$f":"IF(+'Card List'!$C45=\"\",\"\",+'Card List'!$C45)","v":25},{"$f":"IF('Card List'!$D45=\"\",\"\",'Card List'!$D45)","v":7.0000000000000007E-2}]
[{"$f":"IF(+'Card List'!$A46=\"\",\"\",+'Card List'!$A46)","v":0},{"$f":"IF(+'Card List'!$B46=\"\",\"\",+'Card List'!$B46)","v":"Maurices"},{"$f":"IF(+'Card List'!$C46=\"\",\"\",+'Card List'!$C46)","v":20},{"$f":"IF('Card List'!$D46=\"\",\"\",'Card List'!$D46)","v":7.0000000000000007E-2}]
[{"$f":"IF(+'Card List'!$A47=\"\",\"\",+'Card List'!$A47)","v":1},{"$f":"IF(+'Card List'!$B47=\"\",\"\",+'Card List'!$B47)","v":"McDonald's"},{"$f":"IF(+'Card List'!$C47=\"\",\"\",+'Card List'!$C47)","v":10},{"$f":"IF('Card List'!$D47=\"\",\"\",'Card List'!$D47)","v":0.02}]
[{"$f":"IF(+'Card List'!$A48=\"\",\"\",+'Card List'!$A48)","v":1},{"$f":"IF(+'Card List'!$B48=\"\",\"\",+'Card List'!$B48)","v":"McDonald's"},{"$f":"IF(+'Card List'!$C48=\"\",\"\",+'Card List'!$C48)","v":25},{"$f":"IF('Card List'!$D48=\"\",\"\",'Card List'!$D48)","v":0.02}]
[{"$f":"IF(+'Card List'!$A49=\"\",\"\",+'Card List'!$A49)","v":0},{"$f":"IF(+'Card List'!$B49=\"\",\"\",+'Card List'!$B49)","v":"Meijer"},{"$f":"IF(+'Card List'!$C49=\"\",\"\",+'Card List'!$C49)","v":25},{"$f":"IF('Card List'!$D49=\"\",\"\",'Card List'!$D49)","v":0.03}]
[{"$f":"IF(+'Card List'!$A50=\"\",\"\",+'Card List'!$A50)","v":0},{"$f":"IF(+'Card List'!$B50=\"\",\"\",+'Card List'!$B50)","v":"Meijer"},{"$f":"IF(+'Card List'!$C50=\"\",\"\",+'Card List'!$C50)","v":50},{"$f":"IF('Card List'!$D50=\"\",\"\",'Card List'!$D50)","v":0.03}]
[{"$f":"IF(+'Card List'!$A51=\"\",\"\",+'Card List'!$A51)","v":1},{"$f":"IF(+'Card List'!$B51=\"\",\"\",+'Card List'!$B51)","v":"Menards"},{"$f":"IF(+'Card List'!$C51=\"\",\"\",+'Card List'!$C51)","v":25},{"$f":"IF('Card List'!$D51=\"\",\"\",'Card List'!$D51)","v":0.03}]
[{"$f":"IF(+'Card List'!$A52=\"\",\"\",+'Card List'!$A52)","v":0},{"$f":"IF(+'Card List'!$B52=\"\",\"\",+'Card List'!$B52)","v":"Michael's"},{"$f":"IF(+'Card List'!$C52=\"\",\"\",+'Card List'!$C52)","v":25},{"$f":"IF('Card List'!$D52=\"\",\"\",'Card List'!$D52)","v":0.04}]
[{"$f":"IF(+'Card List'!$A53=\"\",\"\",+'Card List'!$A53)","v":1},{"$f":"IF(+'Card List'!$B53=\"\",\"\",+'Card List'!$B53)","v":"Noodles & Co"},{"$f":"IF(+'Card List'!$C53=\"\",\"\",+'Card List'!$C53)","v":10},{"$f":"IF('Card List'!$D53=\"\",\"\",'Card List'!$D53)","v":0.08}]
[{"$f":"IF(+'Card List'!$A54=\"\",\"\",+'Card List'!$A54)","v":0},{"$f":"IF(+'Card List'!$B54=\"\",\"\",+'Card List'!$B54)","v":"Old Navy"},{"$f":"IF(+'Card List'!$C54=\"\",\"\",+'Card List'!$C54)","v":25},{"$f":"IF('Card List'!$D54=\"\",\"\",'Card List'!$D54)","v":0.14000000000000001},null,null,"Total Individual Order:"]
[{"$f":"IF(+'Card List'!$A55=\"\",\"\",+'Card List'!$A55)","v":1},{"$f":"IF(+'Card List'!$B55=\"\",\"\",+'Card List'!$B55)","v":"Olive Garden"},{"$f":"IF(+'Card List'!$C55=\"\",\"\",+'Card List'!$C55)","v":25},{"$f":"IF('Card List'!$D55=\"\",\"\",'Card List'!$D55)","v":0.08}]
[null,null,null,null,null,null,"Amount Individual Paid:"]

{"sheet":"Monthly Sales","index":3,"n_rows":158,"n_cols":14,"rows_kept":158,"cut":false,"hidden":false,"merged":[[142,0,142,1],[0,0,1,13],[109,0,109,2],[117,0,118,0],[117,1,118,1],[2,12,2,13],[2,10,2,11],[106,0,106,1],[96,0,96,1],[104,0,104,1],[2,1,3,1],[2,0,3,0],[2,2,2,3],[2,4,2,5],[2,6,2,7],[2,8,2,9],[117,2,117,3],[117,4,117,5],[117,6,117,7],[117,8,117,9],[117,10,117,11],[145,10,145,11],[144,0,144,6],[145,0,146,0],[145,1,146,1],[145,2,145,3],[145,4,145,5],[145,6,145,7],[111,11,111,12],[156,12,156,13],[157,12,157,13],[150,12,150,13],[151,12,151,13],[152,12,152,13],[153,12,153,13],[154,12,154,13],[145,12,146,13],[147,12,147,13],[148,12,148,13],[149,12,149,13],[155,12,155,13],[117,12,117,13],[113,0,114,13],[145,8,145,9],[111,0,111,2],[111,3,111,4],[111,5,111,6],[111,7,111,8],[111,9,111,10],[108,11,108,12],[109,5,109,6],[110,5,110,6],[109,7,109,8],[110,7,110,8],[109,9,109,10],[110,9,110,10],[109,11,109,12],[110,11,110,12],[108,9,108,10],[109,3,109,4],[110,3,110,4],[108,3,108,4],[108,5,108,6],[108,7,108,8]]}
["LCR Scrip Sales for the Month and Year of:   ________________________"]
[]
["Retailer\n(Cards in Stock)","Card Amount","Date:    ",null,"Date:    ",null,"Date:    ",null,"Date:    ",null,"Date:    ",null,"Total Month Sales"]
[null,null,"# Cards","$","# Cards","$","# Cards","$","# Cards","$","# Cards","$","# Cards","$"]
[{"$f":"IF(+'Card List'!$B2=\"\",\"\",+'Card List'!$B2)","v":"Amazon"},{"$f":"IF(+'Card List'!$C2=\"\",\"\",+'Card List'!$C2)","v":25},null,{"$f":"IF(C5=\"\",0,+B5*C5)","v":0},null,{"$f":"IF(E5=\"\",0,+B5*E5)","v":0},null,{"$f":"IF(G5=\"\",0,+B5*G5)","v":0},null,{"$f":"IF(I5=\"\",0,+B5*I5)","v":0},null,{"$f":"IF(K5=\"\",0,+B5*K5)","v":0},{"$f":"+C5+E5+G5+I5+K5","v":0},{"$f":"+D5+F5+H5+J5+L5","v":0}]
[{"$f":"IF(+'Card List'!$B3=\"\",\"\",+'Card List'!$B3)","v":"American Eagle"},{"$f":"IF(+'Card List'!$C3=\"\",\"\",+'Card List'!$C3)","v":25},null,{"$f":"IF(C6=\"\",0,+B6*C6)","v":0},null,{"$f":"IF(E6=\"\",0,+B6*E6)","v":0},null,{"$f":"IF(G6=\"\",0,+B6*G6)","v":0},null,{"$f":"IF(I6=\"\",0,+B6*I6)","v":0},null,{"$f":"IF(K6=\"\",0,+B6*K6)","v":0},{"$f":"+C6+E6+G6+I6+K6","v":0},{"$f":"+D6+F6+H6+J6+L6","v":0}]
[{"$f":"IF(+'Card List'!$B4=\"\",\"\",+'Card List'!$B4)","v":"Apple iTunes"},{"$f":"IF(+'Card List'!$C4=\"\",\"\",+'Card List'!$C4)","v":15},null,0,null,0,null,0,null,0,null,0,0,0]
[{"$f":"IF(+'Card List'!$B5=\"\",\"\",+'Card List'!$B5)","v":"Applebee's"},{"$f":"IF(+'Card List'!$C5=\"\",\"\",+'Card List'!$C5)","v":25},null,0,null,0,null,0,null,0,null,0,0,0]
[{"$f":"IF(+'Card List'!$B6=\"\",\"\",+'Card List'!$B6)","v":"Arby's"},{"$f":"IF(+'Card List'!$C6=\"\",\"\",+'Card List'!$C6)","v":10},null,0,null,0,null,0,null,0,null,0,0,0]
[{"$f":"IF(+'Card List'!$B7=\"\",\"\",+'Card List'!$B7)","v":"Barnes & Noble"},{"$f":"IF(+'Card List'!$C7=\"\",\"\",+'Card List'!$C7)","v":10},null,0,null,0,null,0,null,0,null,0,0,0]
[{"$f":"IF(+'Card List'!$B8=\"\",\"\",+'Card List'!$B8)","v":"Bath & Body Works"},{"$f":"IF(+'Card List'!$C8=\"\",\"\",+'Card List'!$C8)","v":10},null,0,null,0,null,0,null,0,null,0,0,0]
[{"$f":"IF(+'Card List'!$B9=\"\",\"\",+'Card List'!$B9)","v":"Bed Bath & Beyond"},{"$f":"IF(+'Card List'!$C9=\"\",\"\",+'Card List'!$C9)","v":25},null,0,null,0,null,0,null,0,null,0,0,0]
[{"$f":"IF(+'Card List'!$B10=\"\",\"\",+'Card List'!$B10)","v":"Best Buy"},{"$f":"IF(+'Card List'!$C10=\"\",\"\",+'Card List'!$C10)","v":25},null,0,null,0,null,0,null,0,null,0,0,0]
[{"$f":"IF(+'Card List'!$B11=\"\",\"\",+'Card List'!$B11)","v":"BP Oil/Amoco"},{"$f":"IF(+'Card List'!$C11=\"\",\"\",+'Card List'!$C11)","v":50},null,0,null,0,null,0,null,0,null,0,0,0]
[{"$f":"IF(+'Card List'!$B12=\"\",\"\",+'Card List'!$B12)","v":"Buffalo Wild Wings"},{"$f":"IF(+'Card List'!$C12=\"\",\"\",+'Card List'!$C12)","v":25},null,0,null,0,null,0,null,0,null,0,0,0]
[{"$f":"IF(+'Card List'!$B13=\"\",\"\",+'Card List'!$B13)","v":"Burger King"},{"$f":"IF(+'Card List'!$C13=\"\",\"\",+'Card List'!$C13)","v":10},null,0,null,0,null,0,null,0,null,0,0,0]
[{"$f":"IF(+'Card List'!$B14=\"\",\"\",+'Card List'!$B14)","v":"Cheddars"},{"$f":"IF(+'Card List'!$C14=\"\",\"\",+'Card List'!$C14)","v":25},null,0,null,0,null,0,null,0,null,0,0,0]
[{"$f":"IF(+'Card List'!$B15=\"\",\"\",+'Card List'!$B15)","v":"Cheesecake Factory"},{"$f":"IF(+'Card List'!$C15=\"\",\"\",+'Card List'!$C15)","v":25},null,0,null,0,null,0,null,0,null,0,0,0]
[{"$f":"IF(+'Card List'!$B16=\"\",\"\",+'Card List'!$B16)","v":"Chili's/Maggiano's"},{"$f":"IF(+'Card List'!$C16=\"\",\"\",+'Card List'!$C16)","v":25},null,0,null,0,null,0,null,0,null,0,0,0]
[{"$f":"IF(+'Card List'!$B17=\"\",\"\",+'Card List'!$B17)","v":"Chipotle"},{"$f":"IF(+'Card List'!$C17=\"\",\"\",+'Card List'!$C17)","v":10},null,0,null,0,null,0,null,0,null,0,0,0]
[{"$f":"IF(+'Card List'!$B18=\"\",\"\",+'Card List'!$B18)","v":"Cousin's"},{"$f":"IF(+'Card List'!$C18=\"\",\"\",+'Card List'!$C18)","v":10},null,0,null,0,null,0,null,0,null,0,0,0]
[{"$f":"IF(+'Card List'!$B19=\"\",\"\",+'Card List'!$B19)","v":"Cracker Barrel"},{"$f":"IF(+'Card List'!$C19=\"\",\"\",+'Card List'!$C19)","v":25},null,0,null,0,null,0,null,0,null,0,0,0]
[{"$f":"IF(+'Card List'!$B20=\"\",\"\",+'Card List'!$B20)","v":"Dairy Queen"},{"$f":"IF(+'Card List'!$C20=\"\",\"\",+'Card List'!$C20)","v":10},null,0,null,0,null,0,null,0,null,0,0,0]
[{"$f":"IF(+'Card List'!$B21=\"\",\"\",+'Card List'!$B21)","v":"Denny's"},{"$f":"IF(+'Card List'!$C21=\"\",\"\",+'Card List'!$C21)","v":10},null,0,null,0,null,0,null,0,null,0,0,0]
[{"$f":"IF(+'Card List'!$B22=\"\",\"\",+'Card List'!$B22)","v":"Disney"},{"$f":"IF(+'Card List'!$C22=\"\",\"\",+'Card List'!$C22)","v":25},null,0,null,0,null,0,null,0,null,0,0,0]
[{"$f":"IF(+'Card List'!$B23=\"\",\"\",+'Card List'!$B23)","v":"Domino's"},{"$f":"IF(+'Card List'!$C23=\"\",\"\",+'Card List'!$C23)","v":25},null,0,null,0,null,0,null,0,null,0,0,0]
[{"$f":"IF(+'Card List'!$B24=\"\",\"\",+'Card List'!$B24)","v":"Dunkin' "},{"$f":"IF(+'Card List'!$C24=\"\",\"\",+'Card List'!$C24)","v":10},null,0,null,0,null,0,null,0,null,0,0,0]
[{"$f":"IF(+'Card List'!$B25=\"\",\"\",+'Card List'!$B25)","v":"Exxon/Mobil"},{"$f":"IF(+'Card List'!$C25=\"\",\"\",+'Card List'!$C25)","v":50},null,0,null,0,null,0,null,0,null,0,0,0]
[{"$f":"IF(+'Card List'!$B26=\"\",\"\",+'Card List'!$B26)","v":"Festival Foods"},{"$f":"IF(+'Card List'!$C26=\"\",\"\",+'Card List'!$C26)","v":25},null,0,null,0,null,0,null,0,null,0,0,0]
[{"$f":"IF(+'Card List'!$B27=\"\",\"\",+'Card List'!$B27)","v":"Festival Foods"},{"$f":"IF(+'Card List'!$C27=\"\",\"\",+'Card List'!$C27)","v":50},null,0,null,0,null,0,null,0,null,0,0,0]
[{"$f":"IF(+'Card List'!$B28=\"\",\"\",+'Card List'!$B28)","v":"Finish Line"},{"$f":"IF(+'Card List'!$C28=\"\",\"\",+'Card List'!$C28)","v":25},null,0,null,0,null,0,null,0,null,0,0,0]
[{"$f":"IF(+'Card List'!$B29=\"\",\"\",+'Card List'!$B29)","v":"GameStop"},{"$f":"IF(+'Card List'!$C29=\"\",\"\",+'Card List'!$C29)","v":25},null,0,null,0,null,0,null,0,null,0,0,0]
[{"$f":"IF(+'Card List'!$B30=\"\",\"\",+'Card List'!$B30)","v":"Gap"},{"$f":"IF(+'Card List'!$C30=\"\",\"\",+'Card List'!$C30)","v":25},null,0,null,0,null,0,null,0,null,0,0,0]
[{"$f":"IF(+'Card List'!$B31=\"\",\"\",+'Card List'!$B31)","v":"Gordon Food Service"},{"$f":"IF(+'Card List'!$C31=\"\",\"\",+'Card List'!$C31)","v":25},null,0,null,0,null,0,null,0,null,0,0,0]
[{"$f":"IF(+'Card List'!$B32=\"\",\"\",+'Card List'!$B32)","v":"Groupon"},{"$f":"IF(+'Card List'!$C32=\"\",\"\",+'Card List'!$C32)","v":25},null,0,null,0,null,0,null,0,null,0,0,0]
[{"$f":"IF(+'Card List'!$B33=\"\",\"\",+'Card List'!$B33)","v":"Hardee's"},{"$f":"IF(+'Card List'!$C33=\"\",\"\",+'Card List'!$C33)","v":10},null,0,null,0,null,0,null,0,null,0,0,0]
[{"$f":"IF(+'Card List'!$B34=\"\",\"\",+'Card List'!$B34)","v":"Home Depot"},{"$f":"IF(+'Card List'!$C34=\"\",\"\",+'Card List'!$C34)","v":25},null,0,null,0,null,0,null,0,null,0,0,0]
[{"$f":"IF(+'Card List'!$B35=\"\",\"\",+'Card List'!$B35)","v":"Jo-Ann Fabric"},{"$f":"IF(+'Card List'!$C35=\"\",\"\",+'Card List'!$C35)","v":25},null,0,null,0,null,0,null,0,null,0,0,0]
[{"$f":"IF(+'Card List'!$B36=\"\",\"\",+'Card List'!$B36)","v":"Journeys"},{"$f":"IF(+'Card List'!$C36=\"\",\"\",+'Card List'!$C36)","v":25},null,0,null,0,null,0,null,0,null,0,0,0]
[{"$f":"IF(+'Card List'!$B37=\"\",\"\",+'Card List'!$B37)","v":"Instacart"},{"$f":"IF(+'Card List'!$C37=\"\",\"\",+'Card List'!$C37)","v":25},null,0,null,0,null,0,null,0,null,0,0,0]
[{"$f":"IF(+'Card List'!$B38=\"\",\"\",+'Card List'!$B38)","v":"Kohl's"},{"$f":"IF(+'Card List'!$C38=\"\",\"\",+'Card List'!$C38)","v":25},null,0,null,0,null,0,null,0,null,0,0,0]
[{"$f":"IF(+'Card List'!$B39=\"\",\"\",+'Card List'!$B39)","v":"Kohl's"},{"$f":"IF(+'Card List'!$C39=\"\",\"\",+'Card List'!$C39)","v":100},null,0,null,0,null,0,null,0,null,0,0,0]
[{"$f":"IF(+'Card List'!$B40=\"\",\"\",+'Card List'!$B40)","v":"Kwik Trip"},{"$f":"IF(+'Card List'!$C40=\"\",\"\",+'Card List'!$C40)","v":25},null,0,null,0,null,0,null,0,null,0,0,0]
[{"$f":"IF(+'Card List'!$B41=\"\",\"\",+'Card List'!$B41)","v":"Kwik Trip"},{"$f":"IF(+'Card List'!$C41=\"\",\"\",+'Card List'!$C41)","v":50},null,0,null,0,null,0,null,0,null,0,0,0]
[{"$f":"IF(+'Card List'!$B42=\"\",\"\",+'Card List'!$B42)","v":"Kwik Trip"},{"$f":"IF(+'Card List'!$C42=\"\",\"\",+'Card List'!$C42)","v":100},null,0,null,0,null,0,null,0,null,0,0,0]
[{"$f":"IF(+'Card List'!$B43=\"\",\"\",+'Card List'!$B43)","v":"Lowe's"},{"$f":"IF(+'Card List'!$C43=\"\",\"\",+'Card List'!$C43)","v":25},null,0,null,0,null,0,null,0,null,0,0,0]
[{"$f":"IF(+'Card List'!$B44=\"\",\"\",+'Card List'!$B44)","v":"Marcus Theatres"},{"$f":"IF(+'Card List'!$C44=\"\",\"\",+'Card List'!$C44)","v":25},null,0,null,0,null,0,null,0,null,0,0,0]
[{"$f":"IF(+'Card List'!$B45=\"\",\"\",+'Card List'!$B45)","v":"Marshalls/TJ Maxx"},{"$f":"IF(+'Card List'!$C45=\"\",\"\",+'Card List'!$C45)","v":25},null,0,null,0,null,0,null,0,null,0,0,0]
[{"$f":"IF(+'Card List'!$B46=\"\",\"\",+'Card List'!$B46)","v":"Maurices"},{"$f":"IF(+'Card List'!$C46=\"\",\"\",+'Card List'!$C46)","v":20},null,0,null,0,null,0,null,0,null,0,0,0]
[{"$f":"IF(+'Card List'!$B47=\"\",\"\",+'Card List'!$B47)","v":"McDonald's"},{"$f":"IF(+'Card List'!$C47=\"\",\"\",+'Card List'!$C47)","v":10},null,0,null,0,null,0,null,0,null,0,0,0]
[{"$f":"IF(+'Card List'!$B48=\"\",\"\",+'Card List'!$B48)","v":"McDonald's"},{"$f":"IF(+'Card List'!$C48=\"\",\"\",+'Card List'!$C48)","v":25},null,0,null,0,null,0,null,0,null,0,0,0]
[{"$f":"IF(+'Card List'!$B49=\"\",\"\",+'Card List'!$B49)","v":"Meijer"},{"$f":"IF(+'Card List'!$C49=\"\",\"\",+'Card List'!$C49)","v":25},null,0,null,0,null,0,null,0,null,0,0,0]
[{"$f":"IF(+'Card List'!$B50=\"\",\"\",+'Card List'!$B50)","v":"Meijer"},{"$f":"IF(+'Card List'!$C50=\"\",\"\",+'Card List'!$C50)","v":50},null,0,null,0,null,0,null,0,null,0,0,0]
[{"$f":"IF(+'Card List'!$B51=\"\",\"\",+'Card List'!$B51)","v":"Menards"},{"$f":"IF(+'Card List'!$C51=\"\",\"\",+'Card List'!$C51)","v":25},null,0,null,0,null,0,null,0,null,0,0,0]
[{"$f":"IF(+'Card List'!$B52=\"\",\"\",+'Card List'!$B52)","v":"Michael's"},{"$f":"IF(+'Card List'!$C52=\"\",\"\",+'Card List'!$C52)","v":25},null,0,null,0,null,0,null,0,null,0,0,0]
[{"$f":"IF(+'Card List'!$B53=\"\",\"\",+'Card List'!$B53)","v":"Noodles & Co"},{"$f":"IF(+'Card List'!$C53=\"\",\"\",+'Card List'!$C53)","v":10},null,0,null,0,null,0,null,0,null,0,0,0]
[{"$f":"IF(+'Card List'!$B54=\"\",\"\",+'Card List'!$B54)","v":"Old Navy"},{"$f":"IF(+'Card List'!$C54=\"\",\"\",+'Card List'!$C54)","v":25},null,0,null,0,null,0,null,0,null,0,0,0]
[{"$f":"IF(+'Card List'!$B55=\"\",\"\",+'Card List'!$B55)","v":"Olive Garden"},{"$f":"IF(+'Card List'!$C55=\"\",\"\",+'Card List'!$C55)","v":25},null,0,null,0,null,0,null,0,null,0,0,0]
[{"$f":"IF(+'Card List'!$B56=\"\",\"\",+'Card List'!$B56)","v":"Panda Express"},{"$f":"IF(+'Card List'!$C56=\"\",\"\",+'Card List'!$C56)","v":25},null,0,null,0,null,0,null,0,null,0,0,0]
[{"$f":"IF(+'Card List'!$B57=\"\",\"\",+'Card List'!$B57)","v":"Panera Bread"},{"$f":"IF(+'Card List'!$C57=\"\",\"\",+'Card List'!$C57)","v":10},null,0,null,0,null,0,null,0,null,0,0,0]
[{"$f":"IF(+'Card List'!$B58=\"\",\"\",+'Card List'!$B58)","v":"Panera Bread"},{"$f":"IF(+'Card List'!$C58=\"\",\"\",+'Card List'!$C58)","v":25},null,0,null,0,null,0,null,0,null,0,0,0]
[{"$f":"IF(+'Card List'!$B59=\"\",\"\",+'Card List'!$B59)","v":"Papa John's"},{"$f":"IF(+'Card List'!$C59=\"\",\"\",+'Card List'!$C59)","v":10},null,0,null,0,null,0,null,0,null,0,0,0]
[{"$f":"IF(+'Card List'!$B60=\"\",\"\",+'Card List'!$B60)","v":"Papa Murphy's"},{"$f":"IF(+'Card List'!$C60=\"\",\"\",+'Card List'!$C60)","v":10},null,0,null,0,null,0,null,0,null,0,0,0]
[{"$f":"IF(+'Card List'!$B61=\"\",\"\",+'Card List'!$B61)","v":"Piggly Wiggly"},{"$f":"IF(+'Card List'!$C61=\"\",\"\",+'Card List'!$C61)","v":25},null,0,null,0,null,0,null,0,null,0,0,0]
[{"$f":"IF(+'Card List'!$B62=\"\",\"\",+'Card List'!$B62)","v":"Piggly Wiggly"},{"$f":"IF(+'Card List'!$C62=\"\",\"\",+'Card List'!$C62)","v":50},null,0,null,0,null,0,null,0,null,0,0,0]
[{"$f":"IF(+'Card List'!$B63=\"\",\"\",+'Card List'!$B63)","v":"Piggly Wiggly"},{"$f":"IF(+'Card List'!$C63=\"\",\"\",+'Card List'!$C63)","v":100},null,0,null,0,null,0,null,0,null,0,0,0]
[{"$f":"IF(+'Card List'!$B64=\"\",\"\",+'Card List'!$B64)","v":"Pizza Hut"},{"$f":"IF(+'Card List'!$C64=\"\",\"\",+'Card List'!$C64)","v":10},null,0,null,0,null,0,null,0,null,0,0,0]
[{"$f":"IF(+'Card List'!$B65=\"\",\"\",+'Card List'!$B65)","v":"Potbelly"},{"$f":"IF(+'Card List'!$C65=\"\",\"\",+'Card List'!$C65)","v":10},null,0,null,0,null,0,null,0,null,0,0,0]
[{"$f":"IF(+'Card List'!$B66=\"\",\"\",+'Card List'!$B66)","v":"Qdoba"},{"$f":"IF(+'Card List'!$C66=\"\",\"\",+'Card List'!$C66)","v":25},null,0,null,0,null,0,null,0,null,0,0,0]
[{"$f":"IF(+'Card List'!$B67=\"\",\"\",+'Card List'!$B67)","v":"Red Lobster"},{"$f":"IF(+'Card List'!$C67=\"\",\"\",+'Card List'!$C67)","v":25},null,{"$f":"IF(C70=\"\",0,+B70*C70)","v":0},null,{"$f":"IF(E70=\"\",0,+B70*E70)","v":0},null,{"$f":"IF(G70=\"\",0,+B70*G70)","v":0},null,{"$f":"IF(I70=\"\",0,+B70*I70)","v":0},null,{"$f":"IF(K70=\"\",0,+B70*K70)","v":0},{"$f":"+C70+E70+G70+I70+K70","v":0},{"$f":"+D70+F70+H70+J70+L70","v":0}]
[{"$f":"IF(+'Card List'!$B68=\"\",\"\",+'Card List'!$B68)","v":"Red Robin"},{"$f":"IF(+'Card List'!$C68=\"\",\"\",+'Card List'!$C68)","v":25},null,0,null,0,null,0,null,0,null,0,0,0]
[{"$f":"IF(+'Card List'!$B69=\"\",\"\",+'Card List'!$B69)","v":"Roundy's"},{"$f":"IF(+'Card List'!$C69=\"\",\"\",+'Card List'!$C69)","v":25},null,0,null,0,null,0,null,0,null,0,0,0]
[{"$f":"IF(+'Card List'!$B70=\"\",\"\",+'Card List'!$B70)","v":"Roundy's"},{"$f":"IF(+'Card List'!$C70=\"\",\"\",+'Card List'!$C70)","v":50},null,0,null,0,null,0,null,0,null,0,0,0]
[{"$f":"IF(+'Card List'!$B71=\"\",\"\",+'Card List'!$B71)","v":"Roundy's"},{"$f":"IF(+'Card List'!$C71=\"\",\"\",+'Card List'!$C71)","v":100},null,0,null,0,null,0,null,0,null,0,0,0]
[{"$f":"IF(+'Card List'!$B72=\"\",\"\",+'Card List'!$B72)","v":"Shell "},{"$f":"IF(+'Card List'!$C72=\"\",\"\",+'Card List'!$C72)","v":25},null,0,null,0,null,0,null,0,null,0,0,0]
[{"$f":"IF(+'Card List'!$B73=\"\",\"\",+'Card List'!$B73)","v":"Speedway"},{"$f":"IF(+'Card List'!$C73=\"\",\"\",+'Card List'!$C73)","v":25},null,0,null,0,null,0,null,0,null,0,0,0]
[{"$f":"IF(+'Card List'!$B74=\"\",\"\",+'Card List'!$B74)","v":"Speedway"},{"$f":"IF(+'Card List'!$C74=\"\",\"\",+'Card List'!$C74)","v":50},null,0,null,0,null,0,null,0,null,0,0,0]
[{"$f":"IF(+'Card List'!$B75=\"\",\"\",+'Card List'!$B75)","v":"Speedway"},{"$f":"IF(+'Card List'!$C75=\"\",\"\",+'Card List'!$C75)","v":100},null,0,null,0,null,0,null,0,null,0,0,0]
[{"$f":"IF(+'Card List'!$B76=\"\",\"\",+'Card List'!$B76)","v":"Starbucks"},{"$f":"IF(+'Card List'!$C76=\"\",\"\",+'Card List'!$C76)","v":10},null,0,null,0,null,0,null,0,null,0,0,0]
[{"$f":"IF(+'Card List'!$B77=\"\",\"\",+'Card List'!$B77)","v":"Starbucks"},{"$f":"IF(+'Card List'!$C77=\"\",\"\",+'Card List'!$C77)","v":25},null,0,null,0,null,0,null,0,null,0,0,0]
[{"$f":"IF(+'Card List'!$B78=\"\",\"\",+'Card List'!$B78)","v":"Subway"},{"$f":"IF(+'Card List'!$C78=\"\",\"\",+'Card List'!$C78)","v":10},null,0,null,0,null,0,null,0,null,0,0,0]
[{"$f":"IF(+'Card List'!$B79=\"\",\"\",+'Card List'!$B79)","v":"Taco Bell"},{"$f":"IF(+'Card List'!$C79=\"\",\"\",+'Card List'!$C79)","v":10},null,0,null,0,null,0,null,0,null,0,0,0]
[{"$f":"IF(+'Card List'!$B80=\"\",\"\",+'Card List'!$B80)","v":"Target"},{"$f":"IF(+'Card List'!$C80=\"\",\"\",+'Card List'!$C80)","v":25},null,0,null,0,null,0,null,0,null,0,0,0]
[{"$f":"IF(+'Card List'!$B81=\"\",\"\",+'Card List'!$B81)","v":"Texas Roadhouse"},{"$f":"IF(+'Card List'!$C81=\"\",\"\",+'Card List'!$C81)","v":25},null,0,null,0,null,0,null,0,null,0,0,0]
[{"$f":"IF(+'Card List'!$B82=\"\",\"\",+'Card List'!$B82)","v":"TJ Maxx/Home Goods"},{"$f":"IF(+'Card List'!$C82=\"\",\"\",+'Card List'!$C82)","v":25},null,0,null,0,null,0,null,0,null,0,0,0]
[{"$f":"IF(+'Card List'!$B83=\"\",\"\",+'Card List'!$B83)","v":"Ulta"},{"$f":"IF(+'Card List'!$C83=\"\",\"\",+'Card List'!$C83)","v":25},null,0,null,0,null,0,null,0,null,0,0,0]
[{"$f":"IF(+'Card List'!$B84=\"\",\"\",+'Card List'!$B84)","v":"Walgreens"},{"$f":"IF(+'Card List'!$C84=\"\",\"\",+'Card List'!$C84)","v":25},null,0,null,0,null,0,null,0,null,0,0,0]
[{"$f":"IF(+'Card List'!$B85=\"\",\"\",+'Card List'!$B85)","v":"Walgreens"},{"$f":"IF(+'Card List'!$C85=\"\",\"\",+'Card List'!$C85)","v":100},null,0,null,0,null,0,null,0,null,0,0,0]
[{"$f":"IF(+'Card List'!$B86=\"\",\"\",+'Card List'!$B86)","v":"Walmart"},{"$f":"IF(+'Card List'!$C86=\"\",\"\",+'Card List'!$C86)","v":25},null,0,null,0,null,0,null,0,null,0,0,0]
[{"$f":"IF(+'Card List'!$B87=\"\",\"\",+'Card List'!$B87)","v":"Walmart"},{"$f":"IF(+'Card List'!$C87=\"\",\"\",+'Card List'!$C87)","v":100},null,0,null,0,null,0,null,0,null,0,0,0]
[{"$f":"IF(+'Card List'!$B88=\"\",\"\",+'Card List'!$B88)","v":""},{"$f":"IF(+'Card List'!$C88=\"\",\"\",+'Card List'!$C88)","v":""},null,0,null,0,null,0,null,0,null,0,0,0]
[{"$f":"IF(+'Card List'!$B89=\"\",\"\",+'Card List'!$B89)","v":"Wendy's"},{"$f":"IF(+'Card List'!$C89=\"\",\"\",+'Card List'!$C89)","v":10},null,0,null,0,null,0,null,0,null,0,0,0]
[{"$f":"IF(+'Card List'!$B90=\"\",\"\",+'Card List'!$B90)","v":""},{"$f":"IF(+'Card List'!$C90=\"\",\"\",+'Card List'!$C90)","v":""},null,0,null,0,null,0,null,0,null,0,0,0]
[{"$f":"IF(+'Card List'!$B91=\"\",\"\",+'Card List'!$B91)","v":""},{"$f":"IF(+'Card List'!$C91=\"\",\"\",+'Card List'!$C91)","v":""},null,0,null,0,null,0,null,0,null,0,0,0]
[{"$f":"IF(+'Card List'!$B92=\"\",\"\",+'Card List'!$B92)","v":""},{"$f":"IF(+'Card List'!$C92=\"\",\"\",+'Card List'!$C92)","v":""},null,0,null,0,null,0,null,0,null,0,0,0]
[{"$f":"IF(+'Card List'!$B93=\"\",\"\",+'Card List'!$B93)","v":""},{"$f":"IF(+'Card List'!$C93=\"\",\"\",+'Card List'!$C93)","v":""},null,0,null,0,null,0,null,0,null,0,0,0]
["Total sales of cards in stock",null,{"$f":"+SUM(C5:C96)","v":0},{"$f":"SUM(D5:D96)","v":0},{"$f":"+SUM(E5:E96)","v":0},{"$f":"SUM(F5:F96)","v":0},{"$f":"+SUM(G5:G96)","v":0},{"$f":"SUM(H5:H96)","v":0},{"$f":"+SUM(I5:I96)","v":0},{"$f":"SUM(J5:J96)","v":0},{"$f":"+SUM(K5:K96)","v":0},{"$f":"SUM(L5:L96)","v":0},{"$f":"+SUM(M5:M96)","v":0},{"$f":"SUM(N5:N96)","v":0}]
[]
["Cards needed to be ordered (not in stock):   NOTE if more rows are needed use form on back to list."]
[null,null,null,{"$f":"IF(C100=\"\",0,+$B100*C100)","v":0},null,{"$f":"IF(E100=\"\",0,+$B100*E100)","v":0},null,{"$f":"IF(G100=\"\",0,+$B100*G100)","v":0},null,{"$f":"IF(I100=\"\",0,+$B100*I100)","v":0},null,{"$f":"IF(K100=\"\",0,+$B100*K100)","v":0},{"$f":"+C100+E100+G100+I100+K100","v":0},{"$f":"+D100+F100+H100+J100+L100","v":0}]
[null,null,null,0,null,0,null,0,null,0,null,0,0,0]
[null,null,null,0,null,0,null,0,null,0,null,0,0,0]
[null,null,null,0,null,0,null,0,null,0,null,0,0,0]
[null,null,null,0,null,0,null,0,null,0,null,0,0,0]
["Total sales of cards needing to be ordered",null,{"$f":"SUM(C100:C104)+C143","v":0},0,0,0,0,0,0,0,0,0,0,0]
[]
["TOTAL SALES",null,{"$f":"+C97+C105","v":0},0,0,0,0,0,0,0,0,0,0,0]
[]
["SUMMARY",null,null,{"$f":"+C3","v":"Date:    "},null,{"$f":"+E3","v":"Date:    "},null,{"$f":"+G3","v":"Date:    "},null,{"$f":"+I3","v":"Date:    "},null,{"$f":"+K3","v":"Date:    "},null,"TOTAL"]
["Total Deposit (Cash/Checks)",null,null,0,null,0,null,0,null,0,null,0,null,0]
["Net IOU's from back page (owed - pd back)",null,null,{"$f":"+C158-D158","v":0},null,{"$f":"+E158-F158","v":0},null,{"$f":"+G158-H158","v":0},null,{"$f":"+I158-J158","v":0},null,{"$f":"+K158-L158","v":0},null,0]
["Check:  all must TIE",null,null,{"$f":"IF(+D107-D110-D111=0,\"TIES\",\"$\"&D107-D110-D111&\" ERROR\")","v":"TIES"},null,{"$f":"IF(+F107-F110-F111=0,\"TIES\",\"$\"&F107-F110-F111&\" ERROR\")","v":"TIES"},null,{"$f":"IF(+H107-H110-H111=0,\"TIES\",\"$\"&H107-H110-H111&\" ERROR\")","v":"TIES"},null,{"$f":"IF(+J107-J110-J111=0,\"TIES\",\"$\"&J107-J110-J111&\" ERROR\")","v":"TIES"},null,{"$f":"IF(+L107-L110-L111=0,\"TIES\",\"$\"&L107-L110-L111&\" ERROR\")","v":"TIES"}]
[]
[{"$f":"+A1","v":"LCR Scrip Sales for the Month and Year of:   ________________________"}]
[]
[]
["Cards needed to be ordered (not in stock):   Continued from Front page"]
["Retailer","Card Amount",{"$f":"+C$3","v":"Date:    "},null,{"$f":"+E$3","v":"Date:    "},null,{"$f":"+G$3","v":"Date:    "},null,{"$f":"+I$3","v":"Date:    "},null,{"$f":"+K$3","v":"Date:    "},null,"Total Month Sales"]
[null,null,"# Cards","$","# Cards","$","# Cards","$","# Cards","$","# Cards","$","# Cards","$"]
[null,null,null,{"$f":"IF(C120=\"\",0,+$B120*C120)","v":0},null,{"$f":"IF(E120=\"\",0,+$B120*E120)","v":0},null,{"$f":"IF(G120=\"\",0,+$B120*G120)","v":0},null,{"$f":"IF(I120=\"\",0,+$B120*I120)","v":0},null,{"$f":"IF(K120=\"\",0,+$B120*K120)","v":0},{"$f":"+C120+E120+G120+I120+K120","v":0},{"$f":"+D120+F120+H120+J120+L120","v":0}]
[null,null,null,0,null,0,null,0,null,0,null,0,{"$f":"+C121+E121+G121+I121+K121","v":0},{"$f":"+D121+F121+H121+J121+L121","v":0}]
[null,null,null,0,null,0,null,0,null,0,null,0,0,0]
[null,null,null,0,null,0,null,0,null,0,null,0,0,0]
[null,null,null,0,null,0,null,0,null,0,null,0,0,0]
[null,null,null,0,null,0,null,0,null,0,null,0,0,0]
[null,null,null,0,null,0,null,0,null,0,null,0,0,0]
[null,null,null,0,null,0,null,0,null,0,null,0,0,0]
[null,null,null,0,null,0,null,0,null,0,null,0,0,0]
[null,null,null,0,null,0,null,0,null,0,null,0,0,0]
[null,null,null,0,null,0,null,0,null,0,null,0,0,0]
[null,null,null,0,null,0,null,0,null,0,null,0,0,0]
[null,null,null,0,null,0,null,0,null,0,null,0,0,0]
[null,null,null,0,null,0,null,0,null,0,null,0,0,0]
[null,null,null,0,null,0,null,0,null,0,null,0,0,0]
[null,null,null,0,null,0,null,0,null,0,null,0,0,0]
[null,null,null,0,null,0,null,0,null,0,null,0,0,0]
[null,null,null,0,null,0,null,0,null,0,null,0,0,0]
[null,null,null,0,null,0,null,0,null,0,null,0,0,0]
[null,null,null,0,null,0,null,0,null,0,null,0,0,0]
[null,null,null,0,null,0,null,0,null,0,null,0,0,0]
[null,null,null,0,null,0,null,0,null,0,null,0,0,0]
[null,null,null,0,null,0,null,0,null,0,null,0,0,0]
["Total (included in total on front page)",null,{"$f":"SUM(C120:C142)","v":0},0,0,0,0,0,0,0,0,0,0,0]
[]
["IOU Tracking"]
["Name of IOU Individual","Amt carried forward from last month",{"$f":"+C$3","v":"Date:    "},null,{"$f":"+E$3","v":"Date:    "},null,{"$f":"+G$3","v":"Date:    "},null,{"$f":"+I$3","v":"Date:    "},null,{"$f":"+K$3","v":"Date:    "},null,"Total Still Owed \n(carry forward to next month)"]
[null,null,"$ owed","$ paid back","$ owed","$ paid back","$ owed","$ paid back","$ owed","$ paid back","$ owed","$ paid back"]
[null,null,null,null,null,null,null,null,null,null,null,null,{"$f":"+B148+C148-D148+E148-F148+G148-H148+J148-K148","v":0}]
[null,null,null,null,null,null,null,null,null,null,null,null,{"$f":"+B149+C149-D149+E149-F149+G149-H149+J149-K149","v":0}]
[null,null,null,null,null,null,null,null,null,null,null,null,0]
[null,null,null,null,null,null,null,null,null,null,null,null,{"$f":"+B151+C151-D151+E151-F151+G151-H151+J151-K151","v":0}]
[null,null,null,null,null,null,null,null,null,null,null,null,0]
[null,null,null,null,null,null,null,null,null,null,null,null,0]
[null,null,null,null,null,null,null,null,null,null,null,null,0]
[null,null,null,null,null,null,null,null,null,null,null,null,0]
[null,null,null,null,null,null,null,null,null,null,null,null,0]
[null,null,null,null,null,null,null,null,null,null,null,null,0]
["Total IOU's",{"$f":"SUM(B148:B157)","v":0},0,0,0,0,0,0,0,0,0,0,{"$f":"SUM(M148:N157)","v":0}]

{"sheet":"Monthly Orders","index":4,"n_rows":111,"n_cols":14,"rows_kept":111,"cut":false,"hidden":false,"merged":[[96,0,96,1],[105,0,105,1],[107,0,107,1],[0,0,1,13],[2,0,3,0],[2,1,3,1],[2,2,2,3],[2,4,2,5],[2,6,2,7],[2,8,2,9],[2,10,2,11],[2,12,2,13]]}
["LCR Scrip Purchases for the Month and Year of:   ________________________"]
[]
["Retailer\n(Cards on hand)","Card Amount","Date:    ",null,"Date:    ",null,"Date:    ",null,"Date:    ",null,"Date:    ",null,"Total Month Purchases"]
[null,null,"# Cards","$","# Cards","$","# Cards","$","# Cards","$","# Cards","$","# Cards","$"]
[{"$f":"IF(+'Card List'!$B2=\"\",\"\",+'Card List'!$B2)","v":"Amazon"},{"$f":"IF(+'Card List'!$C2=\"\",\"\",+'Card List'!$C2)","v":25},null,{"$f":"IF(C5=\"\",0,+B5*C5)","v":0},null,{"$f":"IF(E5=\"\",0,+B5*E5)","v":0},null,{"$f":"IF(G5=\"\",0,+B5*G5)","v":0},null,{"$f":"IF(I5=\"\",0,+B5*I5)","v":0},null,{"$f":"IF(K5=\"\",0,+B5*K5)","v":0},{"$f":"+C5+E5+G5+I5+K5","v":0},{"$f":"+D5+F5+H5+J5+L5","v":0}]
[{"$f":"IF(+'Card List'!$B3=\"\",\"\",+'Card List'!$B3)","v":"American Eagle"},{"$f":"IF(+'Card List'!$C3=\"\",\"\",+'Card List'!$C3)","v":25},null,{"$f":"IF(C6=\"\",0,+B6*C6)","v":0},null,{"$f":"IF(E6=\"\",0,+B6*E6)","v":0},null,{"$f":"IF(G6=\"\",0,+B6*G6)","v":0},null,{"$f":"IF(I6=\"\",0,+B6*I6)","v":0},null,{"$f":"IF(K6=\"\",0,+B6*K6)","v":0},{"$f":"+C6+E6+G6+I6+K6","v":0},{"$f":"+D6+F6+H6+J6+L6","v":0}]
[{"$f":"IF(+'Card List'!$B4=\"\",\"\",+'Card List'!$B4)","v":"Apple iTunes"},{"$f":"IF(+'Card List'!$C4=\"\",\"\",+'Card List'!$C4)","v":15},null,0,null,0,null,0,null,0,null,0,0,0]
[{"$f":"IF(+'Card List'!$B5=\"\",\"\",+'Card List'!$B5)","v":"Applebee's"},{"$f":"IF(+'Card List'!$C5=\"\",\"\",+'Card List'!$C5)","v":25},null,0,null,0,null,0,null,0,null,0,0,0]
[{"$f":"IF(+'Card List'!$B6=\"\",\"\",+'Card List'!$B6)","v":"Arby's"},{"$f":"IF(+'Card List'!$C6=\"\",\"\",+'Card List'!$C6)","v":10},null,0,null,0,null,0,null,0,null,0,0,0]
[{"$f":"IF(+'Card List'!$B7=\"\",\"\",+'Card List'!$B7)","v":"Barnes & Noble"},{"$f":"IF(+'Card List'!$C7=\"\",\"\",+'Card List'!$C7)","v":10},null,0,null,0,null,0,null,0,null,0,0,0]
[{"$f":"IF(+'Card List'!$B8=\"\",\"\",+'Card List'!$B8)","v":"Bath & Body Works"},{"$f":"IF(+'Card List'!$C8=\"\",\"\",+'Card List'!$C8)","v":10},null,0,null,0,null,0,null,0,null,0,0,0]
[{"$f":"IF(+'Card List'!$B9=\"\",\"\",+'Card List'!$B9)","v":"Bed Bath & Beyond"},{"$f":"IF(+'Card List'!$C9=\"\",\"\",+'Card List'!$C9)","v":25},null,0,null,0,null,0,null,0,null,0,0,0]
[{"$f":"IF(+'Card List'!$B10=\"\",\"\",+'Card List'!$B10)","v":"Best Buy"},{"$f":"IF(+'Card List'!$C10=\"\",\"\",+'Card List'!$C10)","v":25},null,0,null,0,null,0,null,0,null,0,0,0]
[{"$f":"IF(+'Card List'!$B11=\"\",\"\",+'Card List'!$B11)","v":"BP Oil/Amoco"},{"$f":"IF(+'Card List'!$C11=\"\",\"\",+'Card List'!$C11)","v":50},null,0,null,0,null,0,null,0,null,0,0,0]
[{"$f":"IF(+'Card List'!$B12=\"\",\"\",+'Card List'!$B12)","v":"Buffalo Wild Wings"},{"$f":"IF(+'Card List'!$C12=\"\",\"\",+'Card List'!$C12)","v":25},null,0,null,0,null,0,null,0,null,0,0,0]
[{"$f":"IF(+'Card List'!$B13=\"\",\"\",+'Card List'!$B13)","v":"Burger King"},{"$f":"IF(+'Card List'!$C13=\"\",\"\",+'Card List'!$C13)","v":10},null,0,null,0,null,0,null,0,null,0,0,0]
[{"$f":"IF(+'Card List'!$B14=\"\",\"\",+'Card List'!$B14)","v":"Cheddars"},{"$f":"IF(+'Card List'!$C14=\"\",\"\",+'Card List'!$C14)","v":25},null,0,null,0,null,0,null,0,null,0,0,0]
[{"$f":"IF(+'Card List'!$B15=\"\",\"\",+'Card List'!$B15)","v":"Cheesecake Factory"},{"$f":"IF(+'Card List'!$C15=\"\",\"\",+'Card List'!$C15)","v":25},null,0,null,0,null,0,null,0,null,0,0,0]
[{"$f":"IF(+'Card List'!$B16=\"\",\"\",+'Card List'!$B16)","v":"Chili's/Maggiano's"},{"$f":"IF(+'Card List'!$C16=\"\",\"\",+'Card List'!$C16)","v":25},null,0,null,0,null,0,null,0,null,0,0,0]
[{"$f":"IF(+'Card List'!$B17=\"\",\"\",+'Card List'!$B17)","v":"Chipotle"},{"$f":"IF(+'Card List'!$C17=\"\",\"\",+'Card List'!$C17)","v":10},null,0,null,0,null,0,null,0,null,0,0,0]
[{"$f":"IF(+'Card List'!$B18=\"\",\"\",+'Card List'!$B18)","v":"Cousin's"},{"$f":"IF(+'Card List'!$C18=\"\",\"\",+'Card List'!$C18)","v":10},null,0,null,0,null,0,null,0,null,0,0,0]
[{"$f":"IF(+'Card List'!$B19=\"\",\"\",+'Card List'!$B19)","v":"Cracker Barrel"},{"$f":"IF(+'Card List'!$C19=\"\",\"\",+'Card List'!$C19)","v":25},null,0,null,0,null,0,null,0,null,0,0,0]
[{"$f":"IF(+'Card List'!$B20=\"\",\"\",+'Card List'!$B20)","v":"Dairy Queen"},{"$f":"IF(+'Card List'!$C20=\"\",\"\",+'Card List'!$C20)","v":10},null,0,null,0,null,0,null,0,null,0,0,0]
[{"$f":"IF(+'Card List'!$B21=\"\",\"\",+'Card List'!$B21)","v":"Denny's"},{"$f":"IF(+'Card List'!$C21=\"\",\"\",+'Card List'!$C21)","v":10},null,0,null,0,null,0,null,0,null,0,0,0]
[{"$f":"IF(+'Card List'!$B22=\"\",\"\",+'Card List'!$B22)","v":"Disney"},{"$f":"IF(+'Card List'!$C22=\"\",\"\",+'Card List'!$C22)","v":25},null,0,null,0,null,0,null,0,null,0,0,0]
[{"$f":"IF(+'Card List'!$B23=\"\",\"\",+'Card List'!$B23)","v":"Domino's"},{"$f":"IF(+'Card List'!$C23=\"\",\"\",+'Card List'!$C23)","v":25},null,0,null,0,null,0,null,0,null,0,0,0]
[{"$f":"IF(+'Card List'!$B24=\"\",\"\",+'Card List'!$B24)","v":"Dunkin' "},{"$f":"IF(+'Card List'!$C24=\"\",\"\",+'Card List'!$C24)","v":10},null,0,null,0,null,0,null,0,null,0,0,0]
[{"$f":"IF(+'Card List'!$B25=\"\",\"\",+'Card List'!$B25)","v":"Exxon/Mobil"},{"$f":"IF(+'Card List'!$C25=\"\",\"\",+'Card List'!$C25)","v":50},null,0,null,0,null,0,null,0,null,0,0,0]
[{"$f":"IF(+'Card List'!$B26=\"\",\"\",+'Card List'!$B26)","v":"Festival Foods"},{"$f":"IF(+'Card List'!$C26=\"\",\"\",+'Card List'!$C26)","v":25},null,0,null,0,null,0,null,0,null,0,0,0]
[{"$f":"IF(+'Card List'!$B27=\"\",\"\",+'Card List'!$B27)","v":"Festival Foods"},{"$f":"IF(+'Card List'!$C27=\"\",\"\",+'Card List'!$C27)","v":50},null,0,null,0,null,0,null,0,null,0,0,0]
[{"$f":"IF(+'Card List'!$B28=\"\",\"\",+'Card List'!$B28)","v":"Finish Line"},{"$f":"IF(+'Card List'!$C28=\"\",\"\",+'Card List'!$C28)","v":25},null,0,null,0,null,0,null,0,null,0,0,0]
[{"$f":"IF(+'Card List'!$B29=\"\",\"\",+'Card List'!$B29)","v":"GameStop"},{"$f":"IF(+'Card List'!$C29=\"\",\"\",+'Card List'!$C29)","v":25},null,0,null,0,null,0,null,0,null,0,0,0]
[{"$f":"IF(+'Card List'!$B30=\"\",\"\",+'Card List'!$B30)","v":"Gap"},{"$f":"IF(+'Card List'!$C30=\"\",\"\",+'Card List'!$C30)","v":25},null,0,null,0,null,0,null,0,null,0,0,0]
[{"$f":"IF(+'Card List'!$B31=\"\",\"\",+'Card List'!$B31)","v":"Gordon Food Service"},{"$f":"IF(+'Card List'!$C31=\"\",\"\",+'Card List'!$C31)","v":25},null,0,null,0,null,0,null,0,null,0,0,0]
[{"$f":"IF(+'Card List'!$B32=\"\",\"\",+'Card List'!$B32)","v":"Groupon"},{"$f":"IF(+'Card List'!$C32=\"\",\"\",+'Card List'!$C32)","v":25},null,0,null,0,null,0,null,0,null,0,0,0]
[{"$f":"IF(+'Card List'!$B33=\"\",\"\",+'Card List'!$B33)","v":"Hardee's"},{"$f":"IF(+'Card List'!$C33=\"\",\"\",+'Card List'!$C33)","v":10},null,0,null,0,null,0,null,0,null,0,0,0]
[{"$f":"IF(+'Card List'!$B34=\"\",\"\",+'Card List'!$B34)","v":"Home Depot"},{"$f":"IF(+'Card List'!$C34=\"\",\"\",+'Card List'!$C34)","v":25},null,0,null,0,null,0,null,0,null,0,0,0]
[{"$f":"IF(+'Card List'!$B35=\"\",\"\",+'Card List'!$B35)","v":"Jo-Ann Fabric"},{"$f":"IF(+'Card List'!$C35=\"\",\"\",+'Card List'!$C35)","v":25},null,0,null,0,null,0,null,0,null,0,0,0]
[{"$f":"IF(+'Card List'!$B36=\"\",\"\",+'Card List'!$B36)","v":"Journeys"},{"$f":"IF(+'Card List'!$C36=\"\",\"\",+'Card List'!$C36)","v":25},null,0,null,0,null,0,null,0,null,0,0,0]
[{"$f":"IF(+'Card List'!$B37=\"\",\"\",+'Card List'!$B37)","v":"Instacart"},{"$f":"IF(+'Card List'!$C37=\"\",\"\",+'Card List'!$C37)","v":25},null,0,null,0,null,0,null,0,null,0,0,0]
[{"$f":"IF(+'Card List'!$B38=\"\",\"\",+'Card List'!$B38)","v":"Kohl's"},{"$f":"IF(+'Card List'!$C38=\"\",\"\",+'Card List'!$C38)","v":25},null,0,null,0,null,0,null,0,null,0,0,0]
[{"$f":"IF(+'Card List'!$B39=\"\",\"\",+'Card List'!$B39)","v":"Kohl's"},{"$f":"IF(+'Card List'!$C39=\"\",\"\",+'Card List'!$C39)","v":100},null,0,null,0,null,0,null,0,null,0,0,0]
[{"$f":"IF(+'Card List'!$B40=\"\",\"\",+'Card List'!$B40)","v":"Kwik Trip"},{"$f":"IF(+'Card List'!$C40=\"\",\"\",+'Card List'!$C40)","v":25},null,0,null,0,null,0,null,0,null,0,0,0]
[{"$f":"IF(+'Card List'!$B41=\"\",\"\",+'Card List'!$B41)","v":"Kwik Trip"},{"$f":"IF(+'Card List'!$C41=\"\",\"\",+'Card List'!$C41)","v":50},null,0,null,0,null,0,null,0,null,0,0,0]
[{"$f":"IF(+'Card List'!$B42=\"\",\"\",+'Card List'!$B42)","v":"Kwik Trip"},{"$f":"IF(+'Card List'!$C42=\"\",\"\",+'Card List'!$C42)","v":100},null,0,null,0,null,0,null,0,null,0,0,0]
[{"$f":"IF(+'Card List'!$B43=\"\",\"\",+'Card List'!$B43)","v":"Lowe's"},{"$f":"IF(+'Card List'!$C43=\"\",\"\",+'Card List'!$C43)","v":25},null,0,null,0,null,0,null,0,null,0,0,0]
[{"$f":"IF(+'Card List'!$B44=\"\",\"\",+'Card List'!$B44)","v":"Marcus Theatres"},{"$f":"IF(+'Card List'!$C44=\"\",\"\",+'Card List'!$C44)","v":25},null,0,null,0,null,0,null,0,null,0,0,0]
[{"$f":"IF(+'Card List'!$B45=\"\",\"\",+'Card List'!$B45)","v":"Marshalls/TJ Maxx"},{"$f":"IF(+'Card List'!$C45=\"\",\"\",+'Card List'!$C45)","v":25},null,0,null,0,null,0,null,0,null,0,0,0]
[{"$f":"IF(+'Card List'!$B46=\"\",\"\",+'Card List'!$B46)","v":"Maurices"},{"$f":"IF(+'Card List'!$C46=\"\",\"\",+'Card List'!$C46)","v":20},null,0,null,0,null,0,null,0,null,0,0,0]
[{"$f":"IF(+'Card List'!$B47=\"\",\"\",+'Card List'!$B47)","v":"McDonald's"},{"$f":"IF(+'Card List'!$C47=\"\",\"\",+'Card List'!$C47)","v":10},null,0,null,0,null,0,null,0,null,0,0,0]
[{"$f":"IF(+'Card List'!$B48=\"\",\"\",+'Card List'!$B48)","v":"McDonald's"},{"$f":"IF(+'Card List'!$C48=\"\",\"\",+'Card List'!$C48)","v":25},null,0,null,0,null,0,null,0,null,0,0,0]
[{"$f":"IF(+'Card List'!$B49=\"\",\"\",+'Card List'!$B49)","v":"Meijer"},{"$f":"IF(+'Card List'!$C49=\"\",\"\",+'Card List'!$C49)","v":25},null,0,null,0,null,0,null,0,null,0,0,0]
[{"$f":"IF(+'Card List'!$B50=\"\",\"\",+'Card List'!$B50)","v":"Meijer"},{"$f":"IF(+'Card List'!$C50=\"\",\"\",+'Card List'!$C50)","v":50},null,0,null,0,null,0,null,0,null,0,0,0]
[{"$f":"IF(+'Card List'!$B51=\"\",\"\",+'Card List'!$B51)","v":"Menards"},{"$f":"IF(+'Card List'!$C51=\"\",\"\",+'Card List'!$C51)","v":25},null,0,null,0,null,0,null,0,null,0,0,0]
[{"$f":"IF(+'Card List'!$B52=\"\",\"\",+'Card List'!$B52)","v":"Michael's"},{"$f":"IF(+'Card List'!$C52=\"\",\"\",+'Card List'!$C52)","v":25},null,0,null,0,null,0,null,0,null,0,0,0]
[{"$f":"IF(+'Card List'!$B53=\"\",\"\",+'Card List'!$B53)","v":"Noodles & Co"},{"$f":"IF(+'Card List'!$C53=\"\",\"\",+'Card List'!$C53)","v":10},null,0,null,0,null,0,null,0,null,0,0,0]
[{"$f":"IF(+'Card List'!$B54=\"\",\"\",+'Card List'!$B54)","v":"Old Navy"},{"$f":"IF(+'Card List'!$C54=\"\",\"\",+'Card List'!$C54)","v":25},null,0,null,0,null,0,null,0,null,0,0,0]
[{"$f":"IF(+'Card List'!$B55=\"\",\"\",+'Card List'!$B55)","v":"Olive Garden"},{"$f":"IF(+'Card List'!$C55=\"\",\"\",+'Card List'!$C55)","v":25},null,0,null,0,null,0,null,0,null,0,0,0]
[{"$f":"IF(+'Card List'!$B56=\"\",\"\",+'Card List'!$B56)","v":"Panda Express"},{"$f":"IF(+'Card List'!$C56=\"\",\"\",+'Card List'!$C56)","v":25},null,0,null,0,null,0,null,0,null,0,0,0]
[{"$f":"IF(+'Card List'!$B57=\"\",\"\",+'Card List'!$B57)","v":"Panera Bread"},{"$f":"IF(+'Card List'!$C57=\"\",\"\",+'Card List'!$C57)","v":10},null,0,null,0,null,0,null,0,null,0,0,0]
[{"$f":"IF(+'Card List'!$B58=\"\",\"\",+'Card List'!$B58)","v":"Panera Bread"},{"$f":"IF(+'Card List'!$C58=\"\",\"\",+'Card List'!$C58)","v":25},null,0,null,0,null,0,null,0,null,0,0,0]
[{"$f":"IF(+'Card List'!$B59=\"\",\"\",+'Card List'!$B59)","v":"Papa John's"},{"$f":"IF(+'Card List'!$C59=\"\",\"\",+'Card List'!$C59)","v":10},null,0,null,0,null,0,null,0,null,0,0,0]
[{"$f":"IF(+'Card List'!$B60=\"\",\"\",+'Card List'!$B60)","v":"Papa Murphy's"},{"$f":"IF(+'Card List'!$C60=\"\",\"\",+'Card List'!$C60)","v":10},null,0,null,0,null,0,null,0,null,0,0,0]
[{"$f":"IF(+'Card List'!$B61=\"\",\"\",+'Card List'!$B61)","v":"Piggly Wiggly"},{"$f":"IF(+'Card List'!$C61=\"\",\"\",+'Card List'!$C61)","v":25},null,0,null,0,null,0,null,0,null,0,0,0]
[{"$f":"IF(+'Card List'!$B62=\"\",\"\",+'Card List'!$B62)","v":"Piggly Wiggly"},{"$f":"IF(+'Card List'!$C62=\"\",\"\",+'Card List'!$C62)","v":50},null,0,null,0,null,0,null,0,null,0,0,0]
[{"$f":"IF(+'Card List'!$B63=\"\",\"\",+'Card List'!$B63)","v":"Piggly Wiggly"},{"$f":"IF(+'Card List'!$C63=\"\",\"\",+'Card List'!$C63)","v":100},null,0,null,0,null,0,null,0,null,0,0,0]
[{"$f":"IF(+'Card List'!$B64=\"\",\"\",+'Card List'!$B64)","v":"Pizza Hut"},{"$f":"IF(+'Card List'!$C64=\"\",\"\",+'Card List'!$C64)","v":10},null,0,null,0,null,0,null,0,null,0,0,0]
[{"$f":"IF(+'Card List'!$B65=\"\",\"\",+'Card List'!$B65)","v":"Potbelly"},{"$f":"IF(+'Card List'!$C65=\"\",\"\",+'Card List'!$C65)","v":10},null,0,null,0,null,0,null,0,null,0,0,0]
[{"$f":"IF(+'Card List'!$B66=\"\",\"\",+'Card List'!$B66)","v":"Qdoba"},{"$f":"IF(+'Card List'!$C66=\"\",\"\",+'Card List'!$C66)","v":25},null,0,null,0,null,0,null,0,null,0,0,0]
[{"$f":"IF(+'Card List'!$B67=\"\",\"\",+'Card List'!$B67)","v":"Red Lobster"},{"$f":"IF(+'Card List'!$C67=\"\",\"\",+'Card List'!$C67)","v":25},null,{"$f":"IF(C70=\"\",0,+B70*C70)","v":0},null,{"$f":"IF(E70=\"\",0,+B70*E70)","v":0},null,{"$f":"IF(G70=\"\",0,+B70*G70)","v":0},null,{"$f":"IF(I70=\"\",0,+B70*I70)","v":0},null,{"$f":"IF(K70=\"\",0,+B70*K70)","v":0},{"$f":"+C70+E70+G70+I70+K70","v":0},{"$f":"+D70+F70+H70+J70+L70","v":0}]
[{"$f":"IF(+'Card List'!$B68=\"\",\"\",+'Card List'!$B68)","v":"Red Robin"},{"$f":"IF(+'Card List'!$C68=\"\",\"\",+'Card List'!$C68)","v":25},null,0,null,0,null,0,null,0,null,0,0,0]
[{"$f":"IF(+'Card List'!$B69=\"\",\"\",+'Card List'!$B69)","v":"Roundy's"},{"$f":"IF(+'Card List'!$C69=\"\",\"\",+'Card List'!$C69)","v":25},null,0,null,0,null,0,null,0,null,0,0,0]
[{"$f":"IF(+'Card List'!$B70=\"\",\"\",+'Card List'!$B70)","v":"Roundy's"},{"$f":"IF(+'Card List'!$C70=\"\",\"\",+'Card List'!$C70)","v":50},null,0,null,0,null,0,null,0,null,0,0,0]
[{"$f":"IF(+'Card List'!$B71=\"\",\"\",+'Card List'!$B71)","v":"Roundy's"},{"$f":"IF(+'Card List'!$C71=\"\",\"\",+'Card List'!$C71)","v":100},null,0,null,0,null,0,null,0,null,0,0,0]
[{"$f":"IF(+'Card List'!$B72=\"\",\"\",+'Card List'!$B72)","v":"Shell "},{"$f":"IF(+'Card List'!$C72=\"\",\"\",+'Card List'!$C72)","v":25},null,0,null,0,null,0,null,0,null,0,0,0]
[{"$f":"IF(+'Card List'!$B73=\"\",\"\",+'Card List'!$B73)","v":"Speedway"},{"$f":"IF(+'Card List'!$C73=\"\",\"\",+'Card List'!$C73)","v":25},null,0,null,0,null,0,null,0,null,0,0,0]
[{"$f":"IF(+'Card List'!$B74=\"\",\"\",+'Card List'!$B74)","v":"Speedway"},{"$f":"IF(+'Card List'!$C74=\"\",\"\",+'Card List'!$C74)","v":50},null,0,null,0,null,0,null,0,null,0,0,0]
[{"$f":"IF(+'Card List'!$B75=\"\",\"\",+'Card List'!$B75)","v":"Speedway"},{"$f":"IF(+'Card List'!$C75=\"\",\"\",+'Card List'!$C75)","v":100},null,0,null,0,null,0,null,0,null,0,0,0]
[{"$f":"IF(+'Card List'!$B76=\"\",\"\",+'Card List'!$B76)","v":"Starbucks"},{"$f":"IF(+'Card List'!$C76=\"\",\"\",+'Card List'!$C76)","v":10},null,0,null,0,null,0,null,0,null,0,0,0]
[{"$f":"IF(+'Card List'!$B77=\"\",\"\",+'Card List'!$B77)","v":"Starbucks"},{"$f":"IF(+'Card List'!$C77=\"\",\"\",+'Card List'!$C77)","v":25},null,0,null,0,null,0,null,0,null,0,0,0]
[{"$f":"IF(+'Card List'!$B78=\"\",\"\",+'Card List'!$B78)","v":"Subway"},{"$f":"IF(+'Card List'!$C78=\"\",\"\",+'Card List'!$C78)","v":10},null,0,null,0,null,0,null,0,null,0,0,0]
[{"$f":"IF(+'Card List'!$B79=\"\",\"\",+'Card List'!$B79)","v":"Taco Bell"},{"$f":"IF(+'Card List'!$C79=\"\",\"\",+'Card List'!$C79)","v":10},null,0,null,0,null,0,null,0,null,0,0,0]
[{"$f":"IF(+'Card List'!$B80=\"\",\"\",+'Card List'!$B80)","v":"Target"},{"$f":"IF(+'Card List'!$C80=\"\",\"\",+'Card List'!$C80)","v":25},null,0,null,0,null,0,null,0,null,0,0,0]
[{"$f":"IF(+'Card List'!$B81=\"\",\"\",+'Card List'!$B81)","v":"Texas Roadhouse"},{"$f":"IF(+'Card List'!$C81=\"\",\"\",+'Card List'!$C81)","v":25},null,0,null,0,null,0,null,0,null,0,0,0]
[{"$f":"IF(+'Card List'!$B82=\"\",\"\",+'Card List'!$B82)","v":"TJ Maxx/Home Goods"},{"$f":"IF(+'Card List'!$C82=\"\",\"\",+'Card List'!$C82)","v":25},null,0,null,0,null,0,null,0,null,0,0,0]
[{"$f":"IF(+'Card List'!$B83=\"\",\"\",+'Card List'!$B83)","v":"Ulta"},{"$f":"IF(+'Card List'!$C83=\"\",\"\",+'Card List'!$C83)","v":25},null,0,null,0,null,0,null,0,null,0,0,0]
[{"$f":"IF(+'Card List'!$B84=\"\",\"\",+'Card List'!$B84)","v":"Walgreens"},{"$f":"IF(+'Card List'!$C84=\"\",\"\",+'Card List'!$C84)","v":25},null,0,null,0,null,0,null,0,null,0,0,0]
[{"$f":"IF(+'Card List'!$B85=\"\",\"\",+'Card List'!$B85)","v":"Walgreens"},{"$f":"IF(+'Card List'!$C85=\"\",\"\",+'Card List'!$C85)","v":100},null,0,null,0,null,0,null,0,null,0,0,0]
[{"$f":"IF(+'Card List'!$B86=\"\",\"\",+'Card List'!$B86)","v":"Walmart"},{"$f":"IF(+'Card List'!$C86=\"\",\"\",+'Card List'!$C86)","v":25},null,0,null,0,null,0,null,0,null,0,0,0]
[{"$f":"IF(+'Card List'!$B87=\"\",\"\",+'Card List'!$B87)","v":"Walmart"},{"$f":"IF(+'Card List'!$C87=\"\",\"\",+'Card List'!$C87)","v":100},null,0,null,0,null,0,null,0,null,0,0,0]
[{"$f":"IF(+'Card List'!$B88=\"\",\"\",+'Card List'!$B88)","v":""},{"$f":"IF(+'Card List'!$C88=\"\",\"\",+'Card List'!$C88)","v":""},null,0,null,0,null,0,null,0,null,0,0,0]
[{"$f":"IF(+'Card List'!$B89=\"\",\"\",+'Card List'!$B89)","v":"Wendy's"},{"$f":"IF(+'Card List'!$C89=\"\",\"\",+'Card List'!$C89)","v":10},null,0,null,0,null,0,null,0,null,0,0,0]
[{"$f":"IF(+'Card List'!$B90=\"\",\"\",+'Card List'!$B90)","v":""},{"$f":"IF(+'Card List'!$C90=\"\",\"\",+'Card List'!$C90)","v":""},null,0,null,0,null,0,null,0,null,0,0,0]
[{"$f":"IF(+'Card List'!$B91=\"\",\"\",+'Card List'!$B91)","v":""},{"$f":"IF(+'Card List'!$C91=\"\",\"\",+'Card List'!$C91)","v":""},null,0,null,0,null,0,null,0,null,0,0,0]
[{"$f":"IF(+'Card List'!$B92=\"\",\"\",+'Card List'!$B92)","v":""},{"$f":"IF(+'Card List'!$C92=\"\",\"\",+'Card List'!$C92)","v":""},null,0,null,0,null,0,null,0,null,0,0,0]
[{"$f":"IF(+'Card List'!$B93=\"\",\"\",+'Card List'!$B93)","v":""},{"$f":"IF(+'Card List'!$C93=\"\",\"\",+'Card List'!$C93)","v":""},null,0,null,0,null,0,null,0,null,0,0,0]
["Total Purchases of Cards kept on hand",null,{"$f":"+SUM(C5:C96)","v":0},{"$f":"SUM(D5:D96)","v":0},{"$f":"+SUM(E5:E96)","v":0},{"$f":"SUM(F5:F96)","v":0},{"$f":"+SUM(G5:G96)","v":0},{"$f":"SUM(H5:H96)","v":0},{"$f":"+SUM(I5:I96)","v":0},{"$f":"SUM(J5:J96)","v":0},{"$f":"+SUM(K5:K96)","v":0},{"$f":"SUM(L5:L96)","v":0},{"$f":"+SUM(M5:M96)","v":0},{"$f":"SUM(N5:N96)","v":0}]
[]
["Cards Ordered (not kept on hand):"]
[null,null,null,{"$f":"IF(C100=\"\",0,+$B100*C100)","v":0},null,{"$f":"IF(E100=\"\",0,+$B100*E100)","v":0},null,{"$f":"IF(G100=\"\",0,+$B100*G100)","v":0},null,{"$f":"IF(I100=\"\",0,+$B100*I100)","v":0},null,{"$f":"IF(K100=\"\",0,+$B100*K100)","v":0},{"$f":"+C100+E100+G100+I100+K100","v":0},{"$f":"+D100+F100+H100+J100+L100","v":0}]
[null,null,null,0,null,0,null,0,null,0,null,0,0,0]
[null,null,null,0,null,0,null,0,null,0,null,0,0,0]
[null,null,null,0,null,0,null,0,null,0,null,0,{"$f":"+C103+E103+G103+I103+K103","v":0},0]
[null,null,null,0,null,0,null,0,null,0,null,0,0,0]
[null,null,null,0,null,0,null,0,null,0,null,0,0,0]
["Total Cards Ordered (not kept on hand)",null,{"$f":"SUM(C100:C105)","v":0},0,0,0,0,0,0,0,0,0,0,0]
[]
["Total Order",null,{"$f":"+C97+C106","v":0},0,0,0,0,0,0,0,0,0,0,0]
["Net Cost",null,null,0,null,0,null,0,null,0,null,0,null,{"$f":"+D109+F109+H109+J109+L109","v":0}]
["Shipping/handling charge",null,null,0,null,0,null,0,null,0,null,0,null,0]
["Total Order Cost",null,null,{"$f":"+D109+D110","v":0},null,{"$f":"+F109+F110","v":0},null,{"$f":"+H109+H110","v":0},null,{"$f":"+J109+J110","v":0},null,{"$f":"+L109+L110","v":0},null,{"$f":"+N109+N110","v":0}]

{"sheet":"Monthly Inventory","index":5,"n_rows":108,"n_cols":14,"rows_kept":108,"cut":false,"hidden":false,"merged":[[96,0,96,1],[105,0,105,1],[107,0,107,1],[0,0,1,13],[2,0,3,0],[2,1,3,1],[2,2,2,3],[2,4,2,5],[2,6,2,7],[2,8,2,9],[2,10,2,11],[2,12,2,13]]}
["LCR Scrip Purchases for the Month and Year of:   ________________________"]
[]
["Retailer\n(Cards on hand)","Card Amount","Beginning of Month Inventory",null,"Monthly Sales (of cards kep on hand)",null,"Monthly Orders (of cards kept on hand)",null,"Ending of Month Inventory",null,"Count Validation",null,"Differences"]
[null,null,"# Cards","$","# Cards","$","# Cards","$","# Cards","$","# Cards","$","# Cards","$"]
[{"$f":"+'Monthly Sales'!A5","v":"Amazon"},{"$f":"+'Monthly Sales'!B5","v":25},null,{"$f":"IF(B5=\"\",\"\",IF(C5=\"\",0,+$B5*C5))","v":0},{"$f":"+IF(B5=\"\",\"\",'Monthly Sales'!M5)","v":0},{"$f":"IF(B5=\"\",\"\",IF(E5=\"\",0,+$B5*E5))","v":0},{"$f":"IF(B5=\"\",\"\",+'Monthly Orders'!M5)","v":0},{"$f":"IF(B5=\"\",\"\",IF(G5=\"\",0,+$B5*G5))","v":0},{"$f":"IF(B5=\"\",\"\",+C5-E5+G5)","v":0},{"$f":"IF(B5=\"\",\"\",IF(I5=\"\",0,+$B5*I5))","v":0},null,{"$f":"IF(B5=\"\",\"\",IF(K5=\"\",0,+$B5*K5))","v":0},{"$f":"IF(B5=\"\",\"\",+I5-K5)","v":0},{"$f":"IF(B5=\"\",\"\",+J5-L5)","v":0}]
[{"$f":"+'Monthly Sales'!A6","v":"American Eagle"},{"$f":"+'Monthly Sales'!B6","v":25},null,{"$f":"IF(B6=\"\",\"\",IF(C6=\"\",0,+$B6*C6))","v":0},{"$f":"+IF(B6=\"\",\"\",'Monthly Sales'!M6)","v":0},{"$f":"IF(B6=\"\",\"\",IF(E6=\"\",0,+$B6*E6))","v":0},{"$f":"IF(B6=\"\",\"\",+'Monthly Orders'!M6)","v":0},{"$f":"IF(B6=\"\",\"\",IF(G6=\"\",0,+$B6*G6))","v":0},{"$f":"IF(B6=\"\",\"\",+C6-E6+G6)","v":0},{"$f":"IF(B6=\"\",\"\",IF(I6=\"\",0,+$B6*I6))","v":0},null,{"$f":"IF(B6=\"\",\"\",IF(K6=\"\",0,+$B6*K6))","v":0},{"$f":"IF(B6=\"\",\"\",+I6-K6)","v":0},{"$f":"IF(B6=\"\",\"\",+J6-L6)","v":0}]
[{"$f":"+'Monthly Sales'!A7","v":"Apple iTunes"},{"$f":"+'Monthly Sales'!B7","v":15},null,0,{"$f":"+IF(B7=\"\",\"\",'Monthly Sales'!M7)","v":0},0,{"$f":"IF(B7=\"\",\"\",+'Monthly Orders'!M7)","v":0},0,0,0,null,0,0,0]
[{"$f":"+'Monthly Sales'!A8","v":"Applebee's"},{"$f":"+'Monthly Sales'!B8","v":25},null,0,{"$f":"+IF(B8=\"\",\"\",'Monthly Sales'!M8)","v":0},0,{"$f":"IF(B8=\"\",\"\",+'Monthly Orders'!M8)","v":0},0,0,0,null,0,0,0]
[{"$f":"+'Monthly Sales'!A9","v":"Arby's"},{"$f":"+'Monthly Sales'!B9","v":10},null,0,{"$f":"+IF(B9=\"\",\"\",'Monthly Sales'!M9)","v":0},0,{"$f":"IF(B9=\"\",\"\",+'Monthly Orders'!M9)","v":0},0,0,0,null,0,0,0]
[{"$f":"+'Monthly Sales'!A10","v":"Barnes & Noble"},{"$f":"+'Monthly Sales'!B10","v":10},null,0,{"$f":"+IF(B10=\"\",\"\",'Monthly Sales'!M10)","v":0},0,{"$f":"IF(B10=\"\",\"\",+'Monthly Orders'!M10)","v":0},0,0,0,null,0,0,0]
[{"$f":"+'Monthly Sales'!A11","v":"Bath & Body Works"},{"$f":"+'Monthly Sales'!B11","v":10},null,0,{"$f":"+IF(B11=\"\",\"\",'Monthly Sales'!M11)","v":0},0,{"$f":"IF(B11=\"\",\"\",+'Monthly Orders'!M11)","v":0},0,0,0,null,0,0,0]
[{"$f":"+'Monthly Sales'!A12","v":"Bed Bath & Beyond"},{"$f":"+'Monthly Sales'!B12","v":25},null,0,{"$f":"+IF(B12=\"\",\"\",'Monthly Sales'!M12)","v":0},0,{"$f":"IF(B12=\"\",\"\",+'Monthly Orders'!M12)","v":0},0,0,0,null,0,0,0]
[{"$f":"+'Monthly Sales'!A13","v":"Best Buy"},{"$f":"+'Monthly Sales'!B13","v":25},null,0,{"$f":"+IF(B13=\"\",\"\",'Monthly Sales'!M13)","v":0},0,{"$f":"IF(B13=\"\",\"\",+'Monthly Orders'!M13)","v":0},0,0,0,null,0,0,0]
[{"$f":"+'Monthly Sales'!A14","v":"BP Oil/Amoco"},{"$f":"+'Monthly Sales'!B14","v":50},null,0,{"$f":"+IF(B14=\"\",\"\",'Monthly Sales'!M14)","v":0},0,{"$f":"IF(B14=\"\",\"\",+'Monthly Orders'!M14)","v":0},0,0,0,null,0,0,0]
[{"$f":"+'Monthly Sales'!A15","v":"Buffalo Wild Wings"},{"$f":"+'Monthly Sales'!B15","v":25},null,0,{"$f":"+IF(B15=\"\",\"\",'Monthly Sales'!M15)","v":0},0,{"$f":"IF(B15=\"\",\"\",+'Monthly Orders'!M15)","v":0},0,0,0,null,0,0,0]
[{"$f":"+'Monthly Sales'!A16","v":"Burger King"},{"$f":"+'Monthly Sales'!B16","v":10},null,0,{"$f":"+IF(B16=\"\",\"\",'Monthly Sales'!M16)","v":0},0,{"$f":"IF(B16=\"\",\"\",+'Monthly Orders'!M16)","v":0},0,0,0,null,0,0,0]
[{"$f":"+'Monthly Sales'!A17","v":"Cheddars"},{"$f":"+'Monthly Sales'!B17","v":25},null,0,{"$f":"+IF(B17=\"\",\"\",'Monthly Sales'!M17)","v":0},0,{"$f":"IF(B17=\"\",\"\",+'Monthly Orders'!M17)","v":0},0,0,0,null,0,0,0]
[{"$f":"+'Monthly Sales'!A18","v":"Cheesecake Factory"},{"$f":"+'Monthly Sales'!B18","v":25},null,0,{"$f":"+IF(B18=\"\",\"\",'Monthly Sales'!M18)","v":0},0,{"$f":"IF(B18=\"\",\"\",+'Monthly Orders'!M18)","v":0},0,0,0,null,0,0,0]
[{"$f":"+'Monthly Sales'!A19","v":"Chili's/Maggiano's"},{"$f":"+'Monthly Sales'!B19","v":25},null,0,{"$f":"+IF(B19=\"\",\"\",'Monthly Sales'!M19)","v":0},0,{"$f":"IF(B19=\"\",\"\",+'Monthly Orders'!M19)","v":0},0,0,0,null,0,0,0]
[{"$f":"+'Monthly Sales'!A20","v":"Chipotle"},{"$f":"+'Monthly Sales'!B20","v":10},null,0,{"$f":"+IF(B20=\"\",\"\",'Monthly Sales'!M20)","v":0},0,{"$f":"IF(B20=\"\",\"\",+'Monthly Orders'!M20)","v":0},0,0,0,null,0,0,0]
[{"$f":"+'Monthly Sales'!A21","v":"Cousin's"},{"$f":"+'Monthly Sales'!B21","v":10},null,0,{"$f":"+IF(B21=\"\",\"\",'Monthly Sales'!M21)","v":0},0,{"$f":"IF(B21=\"\",\"\",+'Monthly Orders'!M21)","v":0},0,0,0,null,0,0,0]
[{"$f":"+'Monthly Sales'!A22","v":"Cracker Barrel"},{"$f":"+'Monthly Sales'!B22","v":25},null,0,{"$f":"+IF(B22=\"\",\"\",'Monthly Sales'!M22)","v":0},0,{"$f":"IF(B22=\"\",\"\",+'Monthly Orders'!M22)","v":0},0,0,0,null,0,0,0]
[{"$f":"+'Monthly Sales'!A23","v":"Dairy Queen"},{"$f":"+'Monthly Sales'!B23","v":10},null,0,{"$f":"+IF(B23=\"\",\"\",'Monthly Sales'!M23)","v":0},0,{"$f":"IF(B23=\"\",\"\",+'Monthly Orders'!M23)","v":0},0,0,0,null,0,0,0]
[{"$f":"+'Monthly Sales'!A24","v":"Denny's"},{"$f":"+'Monthly Sales'!B24","v":10},null,0,{"$f":"+IF(B24=\"\",\"\",'Monthly Sales'!M24)","v":0},0,{"$f":"IF(B24=\"\",\"\",+'Monthly Orders'!M24)","v":0},0,0,0,null,0,0,0]
[{"$f":"+'Monthly Sales'!A25","v":"Disney"},{"$f":"+'Monthly Sales'!B25","v":25},null,0,{"$f":"+IF(B25=\"\",\"\",'Monthly Sales'!M25)","v":0},0,{"$f":"IF(B25=\"\",\"\",+'Monthly Orders'!M25)","v":0},0,0,0,null,0,0,0]
[{"$f":"+'Monthly Sales'!A26","v":"Domino's"},{"$f":"+'Monthly Sales'!B26","v":25},null,0,{"$f":"+IF(B26=\"\",\"\",'Monthly Sales'!M26)","v":0},0,{"$f":"IF(B26=\"\",\"\",+'Monthly Orders'!M26)","v":0},0,0,0,null,0,0,0]
[{"$f":"+'Monthly Sales'!A27","v":"Dunkin' "},{"$f":"+'Monthly Sales'!B27","v":10},null,0,{"$f":"+IF(B27=\"\",\"\",'Monthly Sales'!M27)","v":0},0,{"$f":"IF(B27=\"\",\"\",+'Monthly Orders'!M27)","v":0},0,0,0,null,0,0,0]
[{"$f":"+'Monthly Sales'!A28","v":"Exxon/Mobil"},{"$f":"+'Monthly Sales'!B28","v":50},null,0,{"$f":"+IF(B28=\"\",\"\",'Monthly Sales'!M28)","v":0},0,{"$f":"IF(B28=\"\",\"\",+'Monthly Orders'!M28)","v":0},0,0,0,null,0,0,0]
[{"$f":"+'Monthly Sales'!A29","v":"Festival Foods"},{"$f":"+'Monthly Sales'!B29","v":25},null,0,{"$f":"+IF(B29=\"\",\"\",'Monthly Sales'!M29)","v":0},0,{"$f":"IF(B29=\"\",\"\",+'Monthly Orders'!M29)","v":0},0,0,0,null,0,0,0]
[{"$f":"+'Monthly Sales'!A30","v":"Festival Foods"},{"$f":"+'Monthly Sales'!B30","v":50},null,0,{"$f":"+IF(B30=\"\",\"\",'Monthly Sales'!M30)","v":0},0,{"$f":"IF(B30=\"\",\"\",+'Monthly Orders'!M30)","v":0},0,0,0,null,0,0,0]
[{"$f":"+'Monthly Sales'!A31","v":"Finish Line"},{"$f":"+'Monthly Sales'!B31","v":25},null,0,{"$f":"+IF(B31=\"\",\"\",'Monthly Sales'!M31)","v":0},0,{"$f":"IF(B31=\"\",\"\",+'Monthly Orders'!M31)","v":0},0,0,0,null,0,0,0]
[{"$f":"+'Monthly Sales'!A32","v":"GameStop"},{"$f":"+'Monthly Sales'!B32","v":25},null,0,{"$f":"+IF(B32=\"\",\"\",'Monthly Sales'!M32)","v":0},0,{"$f":"IF(B32=\"\",\"\",+'Monthly Orders'!M32)","v":0},0,0,0,null,0,0,0]
[{"$f":"+'Monthly Sales'!A33","v":"Gap"},{"$f":"+'Monthly Sales'!B33","v":25},null,0,{"$f":"+IF(B33=\"\",\"\",'Monthly Sales'!M33)","v":0},0,{"$f":"IF(B33=\"\",\"\",+'Monthly Orders'!M33)","v":0},0,0,0,null,0,0,0]
[{"$f":"+'Monthly Sales'!A34","v":"Gordon Food Service"},{"$f":"+'Monthly Sales'!B34","v":25},null,0,{"$f":"+IF(B34=\"\",\"\",'Monthly Sales'!M34)","v":0},0,{"$f":"IF(B34=\"\",\"\",+'Monthly Orders'!M34)","v":0},0,0,0,null,0,0,0]
[{"$f":"+'Monthly Sales'!A35","v":"Groupon"},{"$f":"+'Monthly Sales'!B35","v":25},null,0,{"$f":"+IF(B35=\"\",\"\",'Monthly Sales'!M35)","v":0},0,{"$f":"IF(B35=\"\",\"\",+'Monthly Orders'!M35)","v":0},0,0,0,null,0,0,0]
[{"$f":"+'Monthly Sales'!A36","v":"Hardee's"},{"$f":"+'Monthly Sales'!B36","v":10},null,0,{"$f":"+IF(B36=\"\",\"\",'Monthly Sales'!M36)","v":0},0,{"$f":"IF(B36=\"\",\"\",+'Monthly Orders'!M36)","v":0},0,0,0,null,0,0,0]
[{"$f":"+'Monthly Sales'!A37","v":"Home Depot"},{"$f":"+'Monthly Sales'!B37","v":25},null,0,{"$f":"+IF(B37=\"\",\"\",'Monthly Sales'!M37)","v":0},0,{"$f":"IF(B37=\"\",\"\",+'Monthly Orders'!M37)","v":0},0,0,0,null,0,0,0]
[{"$f":"+'Monthly Sales'!A38","v":"Jo-Ann Fabric"},{"$f":"+'Monthly Sales'!B38","v":25},null,0,{"$f":"+IF(B38=\"\",\"\",'Monthly Sales'!M38)","v":0},0,{"$f":"IF(B38=\"\",\"\",+'Monthly Orders'!M38)","v":0},0,0,0,null,0,0,0]
[{"$f":"+'Monthly Sales'!A39","v":"Journeys"},{"$f":"+'Monthly Sales'!B39","v":25},null,0,{"$f":"+IF(B39=\"\",\"\",'Monthly Sales'!M39)","v":0},0,{"$f":"IF(B39=\"\",\"\",+'Monthly Orders'!M39)","v":0},0,0,0,null,0,0,0]
[{"$f":"+'Monthly Sales'!A40","v":"Instacart"},{"$f":"+'Monthly Sales'!B40","v":25},null,0,{"$f":"+IF(B40=\"\",\"\",'Monthly Sales'!M40)","v":0},0,{"$f":"IF(B40=\"\",\"\",+'Monthly Orders'!M40)","v":0},0,0,0,null,0,0,0]
[{"$f":"+'Monthly Sales'!A41","v":"Kohl's"},{"$f":"+'Monthly Sales'!B41","v":25},null,0,{"$f":"+IF(B41=\"\",\"\",'Monthly Sales'!M41)","v":0},0,{"$f":"IF(B41=\"\",\"\",+'Monthly Orders'!M41)","v":0},0,0,0,null,0,0,0]
[{"$f":"+'Monthly Sales'!A42","v":"Kohl's"},{"$f":"+'Monthly Sales'!B42","v":100},null,0,{"$f":"+IF(B42=\"\",\"\",'Monthly Sales'!M42)","v":0},0,{"$f":"IF(B42=\"\",\"\",+'Monthly Orders'!M42)","v":0},0,0,0,null,0,0,0]
[{"$f":"+'Monthly Sales'!A43","v":"Kwik Trip"},{"$f":"+'Monthly Sales'!B43","v":25},null,0,{"$f":"+IF(B43=\"\",\"\",'Monthly Sales'!M43)","v":0},0,{"$f":"IF(B43=\"\",\"\",+'Monthly Orders'!M43)","v":0},0,0,0,null,0,0,0]
[{"$f":"+'Monthly Sales'!A44","v":"Kwik Trip"},{"$f":"+'Monthly Sales'!B44","v":50},null,0,{"$f":"+IF(B44=\"\",\"\",'Monthly Sales'!M44)","v":0},0,{"$f":"IF(B44=\"\",\"\",+'Monthly Orders'!M44)","v":0},0,0,0,null,0,0,0]
[{"$f":"+'Monthly Sales'!A45","v":"Kwik Trip"},{"$f":"+'Monthly Sales'!B45","v":100},null,0,{"$f":"+IF(B45=\"\",\"\",'Monthly Sales'!M45)","v":0},0,{"$f":"IF(B45=\"\",\"\",+'Monthly Orders'!M45)","v":0},0,0,0,null,0,0,0]
[{"$f":"+'Monthly Sales'!A46","v":"Lowe's"},{"$f":"+'Monthly Sales'!B46","v":25},null,0,{"$f":"+IF(B46=\"\",\"\",'Monthly Sales'!M46)","v":0},0,{"$f":"IF(B46=\"\",\"\",+'Monthly Orders'!M46)","v":0},0,0,0,null,0,0,0]
[{"$f":"+'Monthly Sales'!A47","v":"Marcus Theatres"},{"$f":"+'Monthly Sales'!B47","v":25},null,0,{"$f":"+IF(B47=\"\",\"\",'Monthly Sales'!M47)","v":0},0,{"$f":"IF(B47=\"\",\"\",+'Monthly Orders'!M47)","v":0},0,0,0,null,0,0,0]
[{"$f":"+'Monthly Sales'!A48","v":"Marshalls/TJ Maxx"},{"$f":"+'Monthly Sales'!B48","v":25},null,0,{"$f":"+IF(B48=\"\",\"\",'Monthly Sales'!M48)","v":0},0,{"$f":"IF(B48=\"\",\"\",+'Monthly Orders'!M48)","v":0},0,0,0,null,0,0,0]
[{"$f":"+'Monthly Sales'!A49","v":"Maurices"},{"$f":"+'Monthly Sales'!B49","v":20},null,0,{"$f":"+IF(B49=\"\",\"\",'Monthly Sales'!M49)","v":0},0,{"$f":"IF(B49=\"\",\"\",+'Monthly Orders'!M49)","v":0},0,0,0,null,0,0,0]
[{"$f":"+'Monthly Sales'!A50","v":"McDonald's"},{"$f":"+'Monthly Sales'!B50","v":10},null,0,{"$f":"+IF(B50=\"\",\"\",'Monthly Sales'!M50)","v":0},0,{"$f":"IF(B50=\"\",\"\",+'Monthly Orders'!M50)","v":0},0,0,0,null,0,0,0]
[{"$f":"+'Monthly Sales'!A51","v":"McDonald's"},{"$f":"+'Monthly Sales'!B51","v":25},null,0,{"$f":"+IF(B51=\"\",\"\",'Monthly Sales'!M51)","v":0},0,{"$f":"IF(B51=\"\",\"\",+'Monthly Orders'!M51)","v":0},0,0,0,null,0,0,0]
[{"$f":"+'Monthly Sales'!A52","v":"Meijer"},{"$f":"+'Monthly Sales'!B52","v":25},null,0,{"$f":"+IF(B52=\"\",\"\",'Monthly Sales'!M52)","v":0},0,{"$f":"IF(B52=\"\",\"\",+'Monthly Orders'!M52)","v":0},0,0,0,null,0,0,0]
[{"$f":"+'Monthly Sales'!A53","v":"Meijer"},{"$f":"+'Monthly Sales'!B53","v":50},null,0,{"$f":"+IF(B53=\"\",\"\",'Monthly Sales'!M53)","v":0},0,{"$f":"IF(B53=\"\",\"\",+'Monthly Orders'!M53)","v":0},0,0,0,null,0,0,0]
[{"$f":"+'Monthly Sales'!A54","v":"Menards"},{"$f":"+'Monthly Sales'!B54","v":25},null,0,{"$f":"+IF(B54=\"\",\"\",'Monthly Sales'!M54)","v":0},0,{"$f":"IF(B54=\"\",\"\",+'Monthly Orders'!M54)","v":0},0,0,0,null,0,0,0]
[{"$f":"+'Monthly Sales'!A55","v":"Michael's"},{"$f":"+'Monthly Sales'!B55","v":25},null,0,{"$f":"+IF(B55=\"\",\"\",'Monthly Sales'!M55)","v":0},0,{"$f":"IF(B55=\"\",\"\",+'Monthly Orders'!M55)","v":0},0,0,0,null,0,0,0]
[{"$f":"+'Monthly Sales'!A56","v":"Noodles & Co"},{"$f":"+'Monthly Sales'!B56","v":10},null,0,{"$f":"+IF(B56=\"\",\"\",'Monthly Sales'!M56)","v":0},0,{"$f":"IF(B56=\"\",\"\",+'Monthly Orders'!M56)","v":0},0,0,0,null,0,0,0]
[{"$f":"+'Monthly Sales'!A57","v":"Old Navy"},{"$f":"+'Monthly Sales'!B57","v":25},null,0,{"$f":"+IF(B57=\"\",\"\",'Monthly Sales'!M57)","v":0},0,{"$f":"IF(B57=\"\",\"\",+'Monthly Orders'!M57)","v":0},0,0,0,null,0,0,0]
[{"$f":"+'Monthly Sales'!A58","v":"Olive Garden"},{"$f":"+'Monthly Sales'!B58","v":25},null,0,{"$f":"+IF(B58=\"\",\"\",'Monthly Sales'!M58)","v":0},0,{"$f":"IF(B58=\"\",\"\",+'Monthly Orders'!M58)","v":0},0,0,0,null,0,0,0]
[{"$f":"+'Monthly Sales'!A59","v":"Panda Express"},{"$f":"+'Monthly Sales'!B59","v":25},null,0,{"$f":"+IF(B59=\"\",\"\",'Monthly Sales'!M59)","v":0},0,{"$f":"IF(B59=\"\",\"\",+'Monthly Orders'!M59)","v":0},0,0,0,null,0,0,0]
[{"$f":"+'Monthly Sales'!A60","v":"Panera Bread"},{"$f":"+'Monthly Sales'!B60","v":10},null,0,{"$f":"+IF(B60=\"\",\"\",'Monthly Sales'!M60)","v":0},0,{"$f":"IF(B60=\"\",\"\",+'Monthly Orders'!M60)","v":0},0,0,0,null,0,0,0]
[{"$f":"+'Monthly Sales'!A61","v":"Panera Bread"},{"$f":"+'Monthly Sales'!B61","v":25},null,0,{"$f":"+IF(B61=\"\",\"\",'Monthly Sales'!M61)","v":0},0,{"$f":"IF(B61=\"\",\"\",+'Monthly Orders'!M61)","v":0},0,0,0,null,0,0,0]
[{"$f":"+'Monthly Sales'!A62","v":"Papa John's"},{"$f":"+'Monthly Sales'!B62","v":10},null,0,{"$f":"+IF(B62=\"\",\"\",'Monthly Sales'!M62)","v":0},0,{"$f":"IF(B62=\"\",\"\",+'Monthly Orders'!M62)","v":0},0,0,0,null,0,0,0]
[{"$f":"+'Monthly Sales'!A63","v":"Papa Murphy's"},{"$f":"+'Monthly Sales'!B63","v":10},null,0,{"$f":"+IF(B63=\"\",\"\",'Monthly Sales'!M63)","v":0},0,{"$f":"IF(B63=\"\",\"\",+'Monthly Orders'!M63)","v":0},0,0,0,null,0,0,0]
[{"$f":"+'Monthly Sales'!A64","v":"Piggly Wiggly"},{"$f":"+'Monthly Sales'!B64","v":25},null,0,{"$f":"+IF(B64=\"\",\"\",'Monthly Sales'!M64)","v":0},0,{"$f":"IF(B64=\"\",\"\",+'Monthly Orders'!M64)","v":0},0,0,0,null,0,0,0]
[{"$f":"+'Monthly Sales'!A65","v":"Piggly Wiggly"},{"$f":"+'Monthly Sales'!B65","v":50},null,0,{"$f":"+IF(B65=\"\",\"\",'Monthly Sales'!M65)","v":0},0,{"$f":"IF(B65=\"\",\"\",+'Monthly Orders'!M65)","v":0},0,0,0,null,0,0,0]
[{"$f":"+'Monthly Sales'!A66","v":"Piggly Wiggly"},{"$f":"+'Monthly Sales'!B66","v":100},null,0,{"$f":"+IF(B66=\"\",\"\",'Monthly Sales'!M66)","v":0},0,{"$f":"IF(B66=\"\",\"\",+'Monthly Orders'!M66)","v":0},0,0,0,null,0,0,0]
[{"$f":"+'Monthly Sales'!A67","v":"Pizza Hut"},{"$f":"+'Monthly Sales'!B67","v":10},null,0,{"$f":"+IF(B67=\"\",\"\",'Monthly Sales'!M67)","v":0},0,{"$f":"IF(B67=\"\",\"\",+'Monthly Orders'!M67)","v":0},0,0,0,null,0,0,0]
[{"$f":"+'Monthly Sales'!A68","v":"Potbelly"},{"$f":"+'Monthly Sales'!B68","v":10},null,0,{"$f":"+IF(B68=\"\",\"\",'Monthly Sales'!M68)","v":0},0,{"$f":"IF(B68=\"\",\"\",+'Monthly Orders'!M68)","v":0},0,0,0,null,0,0,0]
[{"$f":"+'Monthly Sales'!A69","v":"Qdoba"},{"$f":"+'Monthly Sales'!B69","v":25},null,0,{"$f":"+IF(B69=\"\",\"\",'Monthly Sales'!M69)","v":0},0,{"$f":"IF(B69=\"\",\"\",+'Monthly Orders'!M69)","v":0},0,0,0,null,0,0,0]
[{"$f":"+'Monthly Sales'!A70","v":"Red Lobster"},{"$f":"+'Monthly Sales'!B70","v":25},null,{"$f":"IF(B70=\"\",\"\",IF(C70=\"\",0,+$B70*C70))","v":0},{"$f":"+IF(B70=\"\",\"\",'Monthly Sales'!M70)","v":0},{"$f":"IF(B70=\"\",\"\",IF(E70=\"\",0,+$B70*E70))","v":0},{"$f":"IF(B70=\"\",\"\",+'Monthly Orders'!M70)","v":0},{"$f":"IF(B70=\"\",\"\",IF(G70=\"\",0,+$B70*G70))","v":0},{"$f":"IF(B70=\"\",\"\",+C70-E70+G70)","v":0},{"$f":"IF(B70=\"\",\"\",IF(I70=\"\",0,+$B70*I70))","v":0},null,{"$f":"IF(B70=\"\",\"\",IF(K70=\"\",0,+$B70*K70))","v":0},{"$f":"IF(B70=\"\",\"\",+I70-K70)","v":0},{"$f":"IF(B70=\"\",\"\",+J70-L70)","v":0}]
[{"$f":"+'Monthly Sales'!A71","v":"Red Robin"},{"$f":"+'Monthly Sales'!B71","v":25},null,0,{"$f":"+IF(B71=\"\",\"\",'Monthly Sales'!M71)","v":0},0,{"$f":"IF(B71=\"\",\"\",+'Monthly Orders'!M71)","v":0},0,0,0,null,0,0,0]
[{"$f":"+'Monthly Sales'!A72","v":"Roundy's"},{"$f":"+'Monthly Sales'!B72","v":25},null,0,{"$f":"+IF(B72=\"\",\"\",'Monthly Sales'!M72)","v":0},0,{"$f":"IF(B72=\"\",\"\",+'Monthly Orders'!M72)","v":0},0,0,0,null,0,0,0]
[{"$f":"+'Monthly Sales'!A73","v":"Roundy's"},{"$f":"+'Monthly Sales'!B73","v":50},null,0,{"$f":"+IF(B73=\"\",\"\",'Monthly Sales'!M73)","v":0},0,{"$f":"IF(B73=\"\",\"\",+'Monthly Orders'!M73)","v":0},0,0,0,null,0,0,0]
[{"$f":"+'Monthly Sales'!A74","v":"Roundy's"},{"$f":"+'Monthly Sales'!B74","v":100},null,0,{"$f":"+IF(B74=\"\",\"\",'Monthly Sales'!M74)","v":0},0,{"$f":"IF(B74=\"\",\"\",+'Monthly Orders'!M74)","v":0},0,0,0,null,0,0,0]
[{"$f":"+'Monthly Sales'!A75","v":"Shell "},{"$f":"+'Monthly Sales'!B75","v":25},null,0,{"$f":"+IF(B75=\"\",\"\",'Monthly Sales'!M75)","v":0},0,{"$f":"IF(B75=\"\",\"\",+'Monthly Orders'!M75)","v":0},0,0,0,null,0,0,0]
[{"$f":"+'Monthly Sales'!A76","v":"Speedway"},{"$f":"+'Monthly Sales'!B76","v":25},null,0,{"$f":"+IF(B76=\"\",\"\",'Monthly Sales'!M76)","v":0},0,{"$f":"IF(B76=\"\",\"\",+'Monthly Orders'!M76)","v":0},0,0,0,null,0,0,0]
[{"$f":"+'Monthly Sales'!A77","v":"Speedway"},{"$f":"+'Monthly Sales'!B77","v":50},null,0,{"$f":"+IF(B77=\"\",\"\",'Monthly Sales'!M77)","v":0},0,{"$f":"IF(B77=\"\",\"\",+'Monthly Orders'!M77)","v":0},0,0,0,null,0,0,0]
[{"$f":"+'Monthly Sales'!A78","v":"Speedway"},{"$f":"+'Monthly Sales'!B78","v":100},null,0,{"$f":"+IF(B78=\"\",\"\",'Monthly Sales'!M78)","v":0},0,{"$f":"IF(B78=\"\",\"\",+'Monthly Orders'!M78)","v":0},0,0,0,null,0,0,0]
[{"$f":"+'Monthly Sales'!A79","v":"Starbucks"},{"$f":"+'Monthly Sales'!B79","v":10},null,0,{"$f":"+IF(B79=\"\",\"\",'Monthly Sales'!M79)","v":0},0,{"$f":"IF(B79=\"\",\"\",+'Monthly Orders'!M79)","v":0},0,0,0,null,0,0,0]
[{"$f":"+'Monthly Sales'!A80","v":"Starbucks"},{"$f":"+'Monthly Sales'!B80","v":25},null,0,{"$f":"+IF(B80=\"\",\"\",'Monthly Sales'!M80)","v":0},0,{"$f":"IF(B80=\"\",\"\",+'Monthly Orders'!M80)","v":0},0,0,0,null,0,0,0]
[{"$f":"+'Monthly Sales'!A81","v":"Subway"},{"$f":"+'Monthly Sales'!B81","v":10},null,0,{"$f":"+IF(B81=\"\",\"\",'Monthly Sales'!M81)","v":0},0,{"$f":"IF(B81=\"\",\"\",+'Monthly Orders'!M81)","v":0},0,0,0,null,0,0,0]
[{"$f":"+'Monthly Sales'!A82","v":"Taco Bell"},{"$f":"+'Monthly Sales'!B82","v":10},null,0,{"$f":"+IF(B82=\"\",\"\",'Monthly Sales'!M82)","v":0},0,{"$f":"IF(B82=\"\",\"\",+'Monthly Orders'!M82)","v":0},0,0,0,null,0,0,0]
[{"$f":"+'Monthly Sales'!A83","v":"Target"},{"$f":"+'Monthly Sales'!B83","v":25},null,0,{"$f":"+IF(B83=\"\",\"\",'Monthly Sales'!M83)","v":0},0,{"$f":"IF(B83=\"\",\"\",+'Monthly Orders'!M83)","v":0},0,0,0,null,0,0,0]
[{"$f":"+'Monthly Sales'!A84","v":"Texas Roadhouse"},{"$f":"+'Monthly Sales'!B84","v":25},null,0,{"$f":"+IF(B84=\"\",\"\",'Monthly Sales'!M84)","v":0},0,{"$f":"IF(B84=\"\",\"\",+'Monthly Orders'!M84)","v":0},0,0,0,null,0,0,0]
[{"$f":"+'Monthly Sales'!A85","v":"TJ Maxx/Home Goods"},{"$f":"+'Monthly Sales'!B85","v":25},null,0,{"$f":"+IF(B85=\"\",\"\",'Monthly Sales'!M85)","v":0},0,{"$f":"IF(B85=\"\",\"\",+'Monthly Orders'!M85)","v":0},0,0,0,null,0,0,0]
[{"$f":"+'Monthly Sales'!A86","v":"Ulta"},{"$f":"+'Monthly Sales'!B86","v":25},null,0,{"$f":"+IF(B86=\"\",\"\",'Monthly Sales'!M86)","v":0},0,{"$f":"IF(B86=\"\",\"\",+'Monthly Orders'!M86)","v":0},0,0,0,null,0,0,0]
[{"$f":"+'Monthly Sales'!A87","v":"Walgreens"},{"$f":"+'Monthly Sales'!B87","v":25},null,0,{"$f":"+IF(B87=\"\",\"\",'Monthly Sales'!M87)","v":0},0,{"$f":"IF(B87=\"\",\"\",+'Monthly Orders'!M87)","v":0},0,0,0,null,0,0,0]
[{"$f":"+'Monthly Sales'!A88","v":"Walgreens"},{"$f":"+'Monthly Sales'!B88","v":100},null,0,{"$f":"+IF(B88=\"\",\"\",'Monthly Sales'!M88)","v":0},0,{"$f":"IF(B88=\"\",\"\",+'Monthly Orders'!M88)","v":0},0,0,0,null,0,0,0]
[{"$f":"+'Monthly Sales'!A89","v":"Walmart"},{"$f":"+'Monthly Sales'!B89","v":25},null,0,{"$f":"+IF(B89=\"\",\"\",'Monthly Sales'!M89)","v":0},0,{"$f":"IF(B89=\"\",\"\",+'Monthly Orders'!M89)","v":0},0,0,0,null,0,0,0]
[{"$f":"+'Monthly Sales'!A90","v":"Walmart"},{"$f":"+'Monthly Sales'!B90","v":100},null,0,{"$f":"+IF(B90=\"\",\"\",'Monthly Sales'!M90)","v":0},0,{"$f":"IF(B90=\"\",\"\",+'Monthly Orders'!M90)","v":0},0,0,0,null,0,0,0]
[{"$f":"+'Monthly Sales'!A91","v":""},{"$f":"+'Monthly Sales'!B91","v":""},null,"",{"$f":"+IF(B91=\"\",\"\",'Monthly Sales'!M91)","v":""},"",{"$f":"IF(B91=\"\",\"\",+'Monthly Orders'!M91)","v":""},"","","",null,"","",""]
[{"$f":"+'Monthly Sales'!A92","v":"Wendy's"},{"$f":"+'Monthly Sales'!B92","v":10},null,0,{"$f":"+IF(B92=\"\",\"\",'Monthly Sales'!M92)","v":0},0,{"$f":"IF(B92=\"\",\"\",+'Monthly Orders'!M92)","v":0},0,0,0,null,0,0,0]
[{"$f":"+'Monthly Sales'!A93","v":""},{"$f":"+'Monthly Sales'!B93","v":""},null,"",{"$f":"+IF(B93=\"\",\"\",'Monthly Sales'!M93)","v":""},"",{"$f":"IF(B93=\"\",\"\",+'Monthly Orders'!M93)","v":""},"","","",null,"","",""]
[{"$f":"+'Monthly Sales'!A94","v":""},{"$f":"+'Monthly Sales'!B94","v":""},null,"",{"$f":"+IF(B94=\"\",\"\",'Monthly Sales'!M94)","v":""},"",{"$f":"IF(B94=\"\",\"\",+'Monthly Orders'!M94)","v":""},"","","",null,"","",""]
[{"$f":"+'Monthly Sales'!A95","v":""},{"$f":"+'Monthly Sales'!B95","v":""},null,"",{"$f":"+IF(B95=\"\",\"\",'Monthly Sales'!M95)","v":""},"",{"$f":"IF(B95=\"\",\"\",+'Monthly Orders'!M95)","v":""},"","","",null,"","",""]
[{"$f":"+'Monthly Sales'!A96","v":""},{"$f":"+'Monthly Sales'!B96","v":""},null,"",{"$f":"+IF(B96=\"\",\"\",'Monthly Sales'!M96)","v":""},"",{"$f":"IF(B96=\"\",\"\",+'Monthly Orders'!M96)","v":""},"","","",null,"","",""]
["Total",null,{"$f":"+SUM(C5:C96)","v":0},{"$f":"SUM(D5:D96)","v":0},{"$f":"+SUM(E5:E96)","v":0},{"$f":"SUM(F5:F96)","v":0},{"$f":"+SUM(G5:G96)","v":0},{"$f":"SUM(H5:H96)","v":0},{"$f":"+SUM(I5:I96)","v":0},{"$f":"SUM(J5:J96)","v":0},{"$f":"+SUM(K5:K96)","v":0},{"$f":"SUM(L5:L96)","v":0},{"$f":"+SUM(M5:M96)","v":0},{"$f":"SUM(N5:N96)","v":0}]
[]
["Other cards in inventory, if any?"]
[null,null,null,{"$f":"IF(C100=\"\",0,+$B100*C100)","v":0},null,{"$f":"IF(E100=\"\",0,+$B100*E100)","v":0},null,{"$f":"IF(G100=\"\",0,+$B100*G100)","v":0},{"$f":"+C100-E100+G100","v":0},{"$f":"IF(I100=\"\",0,+$B100*I100)","v":0},null,{"$f":"IF(K100=\"\",0,+$B100*K100)","v":0},{"$f":"+I100-K100","v":0},{"$f":"+J100-L100","v":0}]
[null,null,null,0,null,0,null,0,0,0,null,0,0,0]
[null,null,null,0,null,0,null,0,0,0,null,0,0,0]
[null,null,null,0,null,0,null,0,0,0,null,0,0,0]
[null,null,null,0,null,0,null,0,0,0,null,0,0,0]
[null,null,null,0,null,0,null,0,0,0,null,0,0,0]
["Total other cards in inventory",null,{"$f":"SUM(C100:C105)","v":0},0,0,0,0,0,0,0,0,0,0,0]
[]
["Total Inventory",null,{"$f":"+C97+C106","v":0},0,0,0,0,0,0,0,0,0,0,0]

{"sheet":"Formulas","index":6,"n_rows":5,"n_cols":15,"rows_kept":5,"cut":false,"hidden":false,"merged":[[0,1,0,9]]}
[null,"Individual Order Row formulas"]
[null,{"$f":"IF(+'Card List'!$A2=\"\",\"\",+'Card List'!$A2)","v":1},{"$f":"IF(+'Card List'!$B2=\"\",\"\",+'Card List'!$B2)","v":"Amazon"},{"$f":"IF(+'Card List'!$C2=\"\",\"\",+'Card List'!$C2)","v":25},{"$f":"IF('Card List'!$D2=\"\",\"\",'Card List'!$D2)","v":2.2499999999999999E-2},null,{"$f":"IF(+'Card List'!$A56=\"\",\"\",+'Card List'!$A56)","v":1},{"$f":"IF(+'Card List'!$B56=\"\",\"\",+'Card List'!$B56)","v":"Panda Express"},{"$f":"IF(+'Card List'!$C56=\"\",\"\",+'Card List'!$C56)","v":25},{"$f":"IF('Card List'!$D56=\"\",\"\",'Card List'!$D56)","v":0.08}]
[]
[null,"Monthy Sales and Orders Row formulas"]
[null,{"$f":"IF(+'Card List'!$B2=\"\",\"\",+'Card List'!$B2)","v":"Amazon"},{"$f":"IF(+'Card List'!$C2=\"\",\"\",+'Card List'!$C2)","v":25},null,{"$f":"IF(D5=\"\",0,+C5*D5)","v":0},null,{"$f":"IF(F5=\"\",0,+C5*F5)","v":0},null,{"$f":"IF(H5=\"\",0,+C5*H5)","v":0},null,{"$f":"IF(J5=\"\",0,+C5*J5)","v":0},null,{"$f":"IF(L5=\"\",0,+C5*L5)","v":0},{"$f":"+D5+F5+H5+J5+L5","v":0},{"$f":"+E5+G5+I5+K5+M5","v":0}]