{"text_format":"1","workbook":"xlsx","n_sheets":7,"sheets":["Instructions","Card List","Individual Order Form","Monthly Sales","Monthly Orders","Monthly Inventory","Formulas"],"not_rendered":{"charts":0,"images":0,"macros":1,"external_links":0,"defined_names":8,"comments":0,"pivot_tables":0},"unopened":[],"bounds":{"document_bytes":16777216,"sheet_cells":100000,"rows_first":2000,"rows_last":500,"rows_between":2000,"halvings":0,"cell_chars":16384,"cell_head_chars":4096},"cells_cut":0,"cells_raw":0,"read":"whole","date_system":"1900"}

{"sheet":"Instructions","index":0,"n_rows":100,"n_cols":4,"rows_kept":100,"cut":false,"hidden":false,"merged":[[24,3,24,16],[25,3,25,17],[26,3,26,17],[0,0,0,8],[18,3,18,16],[21,3,21,17],[22,3,22,17],[19,3,19,17],[20,3,20,17]]}
["File Instructions"]
["GENERAL:"]
["1)","Use a new File for each month.  Keep the \"Blank\" file so you can copy and use each month."]
[]
["2)","Save files by month and year date.  For example:  Scrip_March2023"]
[]
[]
[null,"Monthly Sales:",null,"This form is to record each week of sales for the month."]
[null,null,null,"It must tie to the deposit (see form)."]
[null,null,null,"In addition, the form tracks all IOUs and the IOU balances."]
[]
[null,"Monthly Orders:",null,"This sheet is to track the monthly cards ordered and costs."]
[null,null,null,"Each order should tie to the order form from the scrip company."]
[]
[null,"Monthly Inventory:",null,"This sheet is to tracks the iventory of cards on hand."]
{"$rows_left_out":86}
{"sheet":"Card List","index":1,"n_rows":89,"n_cols":10,"rows_kept":89,"cut":false,"hidden":false,"merged":[]}
[null,"Retailer","Card Amt.","Profit %"]
[1,"Amazon",25,2.2499999999999999E-2]
[0,"American Eagle",25,0.1]
[0,"Apple iTunes",15,0.05,null,null,null,null,null,"MUST have cursor on column A of row"]
[0,"Applebee's",25,0.08]
[1,"Arby's",10,0.08]
[1,"Barnes & Noble",10,0.08]
[1,"Bath & Body Works",10,0.13]
[0,"Bed Bath & Beyond",25,7.0000000000000007E-2]
[0,"Best Buy",25,0.04]
[1,"BP Oil/Amoco",50,1.4999999999999999E-2]
[0,"Buffalo Wild Wings",25,0.08]
[0,"Burger King",10,0.04]
[0,"Cheddars",25,0.08]
[0,"Cheesecake Factory",25,0.05]
{"$rows_left_out":75}
{"sheet":"Individual Order Form","index":2,"n_rows":56,"n_cols":14,"rows_kept":56,"cut":false,"hidden":false,"merged":[[40,6,40,7],[53,6,54,9],[53,10,54,11],[55,6,56,9],[55,10,56,11]]}
[null,"Retailer","Card Amt.","Profit %","Quantity","Cost",null,"Retailer","Card Amt.","Profit %","Quanity","Cost"]
[{"$f":"IF(+'Card List'!$A2=\"\",\"\",+'Card List'!$A2)","v":1},{"$f":"IF(+'Card List'!$B2=\"\",\"\",+'Card List'!$B2)","v":"Amazon"},{"$f":"IF(+'Card List'!$C2=\"\",\"\",+'Card List'!$C2)","v":25},{"$f":"IF('Card List'!$D2=\"\",\"\",'Card List'!$D2)","v":2.2499999999999999E-2},null,null,{"$f":"IF(+'Card List'!$A56=\"\",\"\",+'Card List'!$A56)","v":1},{"$f":"IF(+'Card List'!$B56=\"\",\"\",+'Card List'!$B56)","v":"Panda Express"},{"$f":"IF(+'Card List'!$C56=\"\",\"\",+'Card List'!$C56)","v":25},{"$f":"IF('Card List'!$D56=\"\",\"\",'Card List'!$D56)","v":0.08},null,null,null,{"$f":"+IF(RIGHT('Card List'!D2,2)=0,LEFT('Card List'!D2,2),'Card List'!D2)","v":2.2499999999999999E-2}]
[{"$f":"IF(+'Card List'!$A3=\"\",\"\",+'Card List'!$A3)","v":0},{"$f":"IF(+'Card List'!$B3=\"\",\"\",+'Card List'!$B3)","v":"American Eagle"},{"$f":"IF(+'Card List'!$C3=\"\",\"\",+'Card List'!$C3)","v":25},{"$f":"IF('Card List'!$D3=\"\",\"\",'Card List'!$D3)","v":0.1},null,null,{"$f":"IF(+'Card List'!$A57=\"\",\"\",+'Card List'!$A57)","v":1},{"$f":"IF(+'Card List'!$B57=\"\",\"\",+'Card List'!$B57)","v":"Panera Bread"},{"$f":"IF(+'Card List'!$C57=\"\",\"\",+'Card List'!$C57)","v":10},{"$f":"IF('Card List'!$D57=\"\",\"\",'Card List'!$D57)","v":0.08},null,null,null,{"$f":"+IF(RIGHT('Card List'!D3,2)=0,LEFT('Card List'!D3,2),'Card List'!D3)","v":0.1}]
[{"$f":"IF(+'Card List'!$A4=\"\",\"\",+'Card List'!$A4)","v":0},{"$f":"IF(+'Card List'!$B4=\"\",\"\",+'Card List'!$B4)","v":"Apple iTunes"},{"$f":"IF(+'Card List'!$C4=\"\",\"\",+'Card List'!$C4)","v":15},{"$f":"IF('Card List'!$D4=\"\",\"\",'Card List'!$D4)","v":0.05},null,null,{"$f":"IF(+'Card List'!$A58=\"\",\"\",+'Card List'!$A58)","v":1},{"$f":"IF(+'Card List'!$B58=\"\",\"\",+'Card List'!$B58)","v":"Panera Bread"},{"$f":"IF(+'Card List'!$C58=\"\",\"\",+'Card List'!$C58)","v":25},{"$f":"IF('Card List'!$D58=\"\",\"\",'Card List'!$D58)","v":0.08}]
[{"$f":"IF(+'Card List'!$A5=\"\",\"\",+'Card List'!$A5)","v":0},{"$f":"IF(+'Card List'!$B5=\"\",\"\",+'Card List'!$B5)","v":"Applebee's"},{"$f":"IF(+'Card List'!$C5=\"\",\"\",+'Card List'!$C5)","v":25},{"$f":"IF('Card List'!$D5=\"\",\"\",'Card List'!$D5)","v":0.08},null,null,{"$f":"IF(+'Card List'!$A59=\"\",\"\",+'Card List'!$A59)","v":0},{"$f":"IF(+'Card List'!$B59=\"\",\"\",+'Card List'!$B59)","v":"Papa John's"},{"$f":"IF(+'Card List'!$C59=\"\",\"\",+'Card List'!$C59)","v":10},{"$f":"IF('Card List'!$D59=\"\",\"\",'Card List'!$D59)","v":0.08}]
[{"$f":"IF(+'Card List'!$A6=\"\",\"\",+'Card List'!$A6)","v":1},{"$f":"IF(+'Card List'!$B6=\"\",\"\",+'Card List'!$B6)","v":"Arby's"},{"$f":"IF(+'Card List'!$C6=\"\",\"\",+'Card List'!$C6)","v":10},{"$f":"IF('Card List'!$D6=\"\",\"\",'Card List'!$D6)","v":0.08},null,null,{"$f":"IF(+'Card List'!$A60=\"\",\"\",+'Card List'!$A60)","v":0},{"$f":"IF(+'Card List'!$B60=\"\",\"\",+'Card List'!$B60)","v":"Papa Murphy's"},{"$f":"IF(+'Card List'!$C60=\"\",\"\",+'Card List'!$C60)","v":10},{"$f":"IF('Card List'!$D60=\"\",\"\",'Card List'!$D60)","v":0.08},null,null,null,{"$f":"IF(N2=0.0225,P2,CELL(\"format\",N2)=p0)","v":0}]
[{"$f":"IF(+'Card List'!$A7=\"\",\"\",+'Card List'!$A7)","v":1},{"$f":"IF(+'Card List'!$B7=\"\",\"\",+'Card List'!$B7)","v":"Barnes & Noble"},{"$f":"IF(+'Card List'!$C7=\"\",\"\",+'Card List'!$C7)","v":10},{"$f":"IF('Card List'!$D7=\"\",\"\",'Card List'!$D7)","v":0.08},null,null,{"$f":"IF(+'Card List'!$A61=\"\",\"\",+'Card List'!$A61)","v":1},{"$f":"IF(+'Card List'!$B61=\"\",\"\",+'Card List'!$B61)","v":"Piggly Wiggly"},{"$f":"IF(+'Card List'!$C61=\"\",\"\",+'Card List'!$C61)","v":25},{"$f":"IF('Card List'!$D61=\"\",\"\",'Card List'!$D61)","v":0.03}]
[{"$f":"IF(+'Card List'!$A8=\"\",\"\",+'Card List'!$A8)","v":1},{"$f":"IF(+'Card List'!$B8=\"\",\"\",+'Card List'!$B8)","v":"Bath & Body Works"},{"$f":"IF(+'Card List'!$C8=\"\",\"\",+'Card List'!$C8)","v":10},{"$f":"IF('Card List'!$D8=\"\",\"\",'Card List'!$D8)","v":0.13},null,null,{"$f":"IF(+'Card List'!$A62=\"\",\"\",+'Card List'!$A62)","v":1},{"$f":"IF(+'Card List'!$B62=\"\",\"\",+'Card List'!$B62)","v":"Piggly Wiggly"},{"$f":"IF(+'Card List'!$C62=\"\",\"\",+'Card List'!$C62)","v":50},{"$f":"IF('Card List'!$D62=\"\",\"\",'Card List'!$D62)","v":0.03}]
[{"$f":"IF(+'Card List'!$A9=\"\",\"\",+'Card List'!$A9)","v":0},{"$f":"IF(+'Card List'!$B9=\"\",\"\",+'Card List'!$B9)","v":"Bed Bath & Beyond"},{"$f":"IF(+'Card List'!$C9=\"\",\"\",+'Card List'!$C9)","v":25},{"$f":"IF('Card List'!$D9=\"\",\"\",'Card List'!$D9)","v":7.0000000000000007E-2},null,null,{"$f":"IF(+'Card List'!$A63=\"\",\"\",+'Card List'!$A63)","v":1},{"$f":"IF(+'Card List'!$B63=\"\",\"\",+'Card List'!$B63)","v":"Piggly Wiggly"},{"$f":"IF(+'Card List'!$C63=\"\",\"\",+'Card List'!$C63)","v":100},{"$f":"IF('Card List'!$D63=\"\",\"\",'Card List'!$D63)","v":0.03}]
[{"$f":"IF(+'Card List'!$A10=\"\",\"\",+'Card List'!$A10)","v":0},{"$f":"IF(+'Card List'!$B10=\"\",\"\",+'Card List'!$B10)","v":"Best Buy"},{"$f":"IF(+'Card List'!$C10=\"\",\"\",+'Card List'!$C10)","v":25},{"$f":"IF('Card List'!$D10=\"\",\"\",'Card List'!$D10)","v":0.04},null,null,{"$f":"IF(+'Card List'!$A64=\"\",\"\",+'Card List'!$A64)","v":0},{"$f":"IF(+'Card List'!$B64=\"\",\"\",+'Card List'!$B64)","v":"Pizza Hut"},{"$f":"IF(+'Card List'!$C64=\"\",\"\",+'Card List'!$C64)","v":10},{"$f":"IF('Card List'!$D64=\"\",\"\",'Card List'!$D64)","v":0.08}]
[{"$f":"IF(+'Card List'!$A11=\"\",\"\",+'Card List'!$A11)","v":1},{"$f":"IF(+'Card List'!$B11=\"\",\"\",+'Card List'!$B11)","v":"BP Oil/Amoco"},{"$f":"IF(+'Card List'!$C11=\"\",\"\",+'Card List'!$C11)","v":50},{"$f":"IF('Card List'!$D11=\"\",\"\",'Card List'!$D11)","v":1.4999999999999999E-2},null,null,{"$f":"IF(+'Card List'!$A65=\"\",\"\",+'Card List'!$A65)","v":0},{"$f":"IF(+'Card List'!$B65=\"\",\"\",+'Card List'!$B65)","v":"Potbelly"},{"$f":"IF(+'Card List'!$C65=\"\",\"\",+'Card List'!$C65)","v":10},{"$f":"IF('Card List'!$D65=\"\",\"\",'Card List'!$D65)","v":0.08}]
[{"$f":"IF(+'Card List'!$A12=\"\",\"\",+'Card List'!$A12)","v":0},{"$f":"IF(+'Card List'!$B12=\"\",\"\",+'Card List'!$B12)","v":"Buffalo Wild Wings"},{"$f":"IF(+'Card List'!$C12=\"\",\"\",+'Card List'!$C12)","v":25},{"$f":"IF('Card List'!$D12=\"\",\"\",'Card List'!$D12)","v":0.08},null,null,{"$f":"IF(+'Card List'!$A66=\"\",\"\",+'Card List'!$A66)","v":0},{"$f":"IF(+'Card List'!$B66=\"\",\"\",+'Card List'!$B66)","v":"Qdoba"},{"$f":"IF(+'Card List'!$C66=\"\",\"\",+'Card List'!$C66)","v":25},{"$f":"IF('Card List'!$D66=\"\",\"\",'Card List'!$D66)","v":7.0000000000000007E-2}]
[{"$f":"IF(+'Card List'!$A13=\"\",\"\",+'Card List'!$A13)","v":0},{"$f":"IF(+'Card List'!$B13=\"\",\"\",+'Card List'!$B13)","v":"Burger King"},{"$f":"IF(+'Card List'!$C13=\"\",\"\",+'Card List'!$C13)","v":10},{"$f":"IF('Card List'!$D13=\"\",\"\",'Card List'!$D13)","v":0.04},null,null,{"$f":"IF(+'Card List'!$A67=\"\",\"\",+'Card List'!$A67)","v":0},{"$f":"IF(+'Card List'!$B67=\"\",\"\",+'Card List'!$B67)","v":"Red Lobster"},{"$f":"IF(+'Card List'!$C67=\"\",\"\",+'Card List'!$C67)","v":25},{"$f":"IF('Card List'!$D67=\"\",\"\",'Card List'!$D67)","v":0.08}]
[{"$f":"IF(+'Card List'!$A14=\"\",\"\",+'Card List'!$A14)","v":0},{"$f":"IF(+'Card List'!$B14=\"\",\"\",+'Card List'!$B14)","v":"Cheddars"},{"$f":"IF(+'Card List'!$C14=\"\",\"\",+'Card List'!$C14)","v":25},{"$f":"IF('Card List'!$D14=\"\",\"\",'Card List'!$D14)","v":0.08},null,null,{"$f":"IF(+'Card List'!$A68=\"\",\"\",+'Card List'!$A68)","v":0},{"$f":"IF(+'Card List'!$B68=\"\",\"\",+'Card List'!$B68)","v":"Red Robin"},{"$f":"IF(+'Card List'!$C68=\"\",\"\",+'Card List'!$C68)","v":25},{"$f":"IF('Card List'!$D68=\"\",\"\",'Card List'!$D68)","v":0.08}]
[{"$f":"IF(+'Card List'!$A15=\"\",\"\",+'Card List'!$A15)","v":0},{"$f":"IF(+'Card List'!$B15=\"\",\"\",+'Card List'!$B15)","v":"Cheesecake Factory"},{"$f":"IF(+'Card List'!$C15=\"\",\"\",+'Card List'!$C15)","v":25},{"$f":"IF('Card List'!$D15=\"\",\"\",'Card List'!$D15)","v":0.05},null,null,{"$f":"IF(+'Card List'!$A69=\"\",\"\",+'Card List'!$A69)","v":1},{"$f":"IF(+'Card List'!$B69=\"\",\"\",+'Card List'!$B69)","v":"Roundy's"},{"$f":"IF(+'Card List'!$C69=\"\",\"\",+'Card List'!$C69)","v":25},{"$f":"IF('Card List'!$D69=\"\",\"\",'Card List'!$D69)","v":0.04}]
{"$rows_left_out":42}
{"sheet":"Monthly Sales","index":3,"n_rows":158,"n_cols":14,"rows_kept":158,"cut":false,"hidden":false,"merged":[[142,0,142,1],[0,0,1,13],[109,0,109,2],[117,0,118,0],[117,1,118,1],[2,12,2,13],[2,10,2,11],[106,0,106,1],[96,0,96,1],[104,0,104,1],[2,1,3,1],[2,0,3,0],[2,2,2,3],[2,4,2,5],[2,6,2,7],[2,8,2,9],[117,2,117,3],[117,4,117,5],[117,6,117,7],[117,8,117,9],[117,10,117,11],[145,10,145,11],[144,0,144,6],[145,0,146,0],[145,1,146,1],[145,2,145,3],[145,4,145,5],[145,6,145,7],[111,11,111,12],[156,12,156,13],[157,12,157,13],[150,12,150,13],[151,12,151,13],[152,12,152,13],[153,12,153,13],[154,12,154,13],[145,12,146,13],[147,12,147,13],[148,12,148,13],[149,12,149,13],[155,12,155,13],[117,12,117,13],[113,0,114,13],[145,8,145,9],[111,0,111,2],[111,3,111,4],[111,5,111,6],[111,7,111,8],[111,9,111,10],[108,11,108,12],[109,5,109,6],[110,5,110,6],[109,7,109,8],[110,7,110,8],[109,9,109,10],[110,9,110,10],[109,11,109,12],[110,11,110,12],[108,9,108,10],[109,3,109,4],[110,3,110,4],[108,3,108,4],[108,5,108,6],[108,7,108,8]]}
["LCR Scrip Sales for the Month and Year of:   ________________________"]
[]
["Retailer\n(Cards in Stock)","Card Amount","Date:    ",null,"Date:    ",null,"Date:    ",null,"Date:    ",null,"Date:    ",null,"Total Month Sales"]
[null,null,"# Cards","$","# Cards","$","# Cards","$","# Cards","$","# Cards","$","# Cards","$"]
[{"$f":"IF(+'Card List'!$B2=\"\",\"\",+'Card List'!$B2)","v":"Amazon"},{"$f":"IF(+'Card List'!$C2=\"\",\"\",+'Card List'!$C2)","v":25},null,{"$f":"IF(C5=\"\",0,+B5*C5)","v":0},null,{"$f":"IF(E5=\"\",0,+B5*E5)","v":0},null,{"$f":"IF(G5=\"\",0,+B5*G5)","v":0},null,{"$f":"IF(I5=\"\",0,+B5*I5)","v":0},null,{"$f":"IF(K5=\"\",0,+B5*K5)","v":0},{"$f":"+C5+E5+G5+I5+K5","v":0},{"$f":"+D5+F5+H5+J5+L5","v":0}]
[{"$f":"IF(+'Card List'!$B3=\"\",\"\",+'Card List'!$B3)","v":"American Eagle"},{"$f":"IF(+'Card List'!$C3=\"\",\"\",+'Card List'!$C3)","v":25},null,{"$f":"IF(C6=\"\",0,+B6*C6)","v":0},null,{"$f":"IF(E6=\"\",0,+B6*E6)","v":0},null,{"$f":"IF(G6=\"\",0,+B6*G6)","v":0},null,{"$f":"IF(I6=\"\",0,+B6*I6)","v":0},null,{"$f":"IF(K6=\"\",0,+B6*K6)","v":0},{"$f":"+C6+E6+G6+I6+K6","v":0},{"$f":"+D6+F6+H6+J6+L6","v":0}]
[{"$f":"IF(+'Card List'!$B4=\"\",\"\",+'Card List'!$B4)","v":"Apple iTunes"},{"$f":"IF(+'Card List'!$C4=\"\",\"\",+'Card List'!$C4)","v":15},null,0,null,0,null,0,null,0,null,0,0,0]
[{"$f":"IF(+'Card List'!$B5=\"\",\"\",+'Card List'!$B5)","v":"Applebee's"},{"$f":"IF(+'Card List'!$C5=\"\",\"\",+'Card List'!$C5)","v":25},null,0,null,0,null,0,null,0,null,0,0,0]
[{"$f":"IF(+'Card List'!$B6=\"\",\"\",+'Card List'!$B6)","v":"Arby's"},{"$f":"IF(+'Card List'!$C6=\"\",\"\",+'Card List'!$C6)","v":10},null,0,null,0,null,0,null,0,null,0,0,0]
[{"$f":"IF(+'Card List'!$B7=\"\",\"\",+'Card List'!$B7)","v":"Barnes & Noble"},{"$f":"IF(+'Card List'!$C7=\"\",\"\",+'Card List'!$C7)","v":10},null,0,null,0,null,0,null,0,null,0,0,0]
[{"$f":"IF(+'Card List'!$B8=\"\",\"\",+'Card List'!$B8)","v":"Bath & Body Works"},{"$f":"IF(+'Card List'!$C8=\"\",\"\",+'Card List'!$C8)","v":10},null,0,null,0,null,0,null,0,null,0,0,0]
[{"$f":"IF(+'Card List'!$B9=\"\",\"\",+'Card List'!$B9)","v":"Bed Bath & Beyond"},{"$f":"IF(+'Card List'!$C9=\"\",\"\",+'Card List'!$C9)","v":25},null,0,null,0,null,0,null,0,null,0,0,0]
[{"$f":"IF(+'Card List'!$B10=\"\",\"\",+'Card List'!$B10)","v":"Best Buy"},{"$f":"IF(+'Card List'!$C10=\"\",\"\",+'Card List'!$C10)","v":25},null,0,null,0,null,0,null,0,null,0,0,0]
[{"$f":"IF(+'Card List'!$B11=\"\",\"\",+'Card List'!$B11)","v":"BP Oil/Amoco"},{"$f":"IF(+'Card List'!$C11=\"\",\"\",+'Card List'!$C11)","v":50},null,0,null,0,null,0,null,0,null,0,0,0]
[{"$f":"IF(+'Card List'!$B12=\"\",\"\",+'Card List'!$B12)","v":"Buffalo Wild Wings"},{"$f":"IF(+'Card List'!$C12=\"\",\"\",+'Card List'!$C12)","v":25},null,0,null,0,null,0,null,0,null,0,0,0]
{"$rows_left_out":144}
{"sheet":"Monthly Orders","index":4,"n_rows":111,"n_cols":14,"rows_kept":111,"cut":false,"hidden":false,"merged":[[96,0,96,1],[105,0,105,1],[107,0,107,1],[0,0,1,13],[2,0,3,0],[2,1,3,1],[2,2,2,3],[2,4,2,5],[2,6,2,7],[2,8,2,9],[2,10,2,11],[2,12,2,13]]}
["LCR Scrip Purchases for the Month and Year of:   ________________________"]
[]
["Retailer\n(Cards on hand)","Card Amount","Date:    ",null,"Date:    ",null,"Date:    ",null,"Date:    ",null,"Date:    ",null,"Total Month Purchases"]
[null,null,"# Cards","$","# Cards","$","# Cards","$","# Cards","$","# Cards","$","# Cards","$"]
[{"$f":"IF(+'Card List'!$B2=\"\",\"\",+'Card List'!$B2)","v":"Amazon"},{"$f":"IF(+'Card List'!$C2=\"\",\"\",+'Card List'!$C2)","v":25},null,{"$f":"IF(C5=\"\",0,+B5*C5)","v":0},null,{"$f":"IF(E5=\"\",0,+B5*E5)","v":0},null,{"$f":"IF(G5=\"\",0,+B5*G5)","v":0},null,{"$f":"IF(I5=\"\",0,+B5*I5)","v":0},null,{"$f":"IF(K5=\"\",0,+B5*K5)","v":0},{"$f":"+C5+E5+G5+I5+K5","v":0},{"$f":"+D5+F5+H5+J5+L5","v":0}]
[{"$f":"IF(+'Card List'!$B3=\"\",\"\",+'Card List'!$B3)","v":"American Eagle"},{"$f":"IF(+'Card List'!$C3=\"\",\"\",+'Card List'!$C3)","v":25},null,{"$f":"IF(C6=\"\",0,+B6*C6)","v":0},null,{"$f":"IF(E6=\"\",0,+B6*E6)","v":0},null,{"$f":"IF(G6=\"\",0,+B6*G6)","v":0},null,{"$f":"IF(I6=\"\",0,+B6*I6)","v":0},null,{"$f":"IF(K6=\"\",0,+B6*K6)","v":0},{"$f":"+C6+E6+G6+I6+K6","v":0},{"$f":"+D6+F6+H6+J6+L6","v":0}]
[{"$f":"IF(+'Card List'!$B4=\"\",\"\",+'Card List'!$B4)","v":"Apple iTunes"},{"$f":"IF(+'Card List'!$C4=\"\",\"\",+'Card List'!$C4)","v":15},null,0,null,0,null,0,null,0,null,0,0,0]
[{"$f":"IF(+'Card List'!$B5=\"\",\"\",+'Card List'!$B5)","v":"Applebee's"},{"$f":"IF(+'Card List'!$C5=\"\",\"\",+'Card List'!$C5)","v":25},null,0,null,0,null,0,null,0,null,0,0,0]
[{"$f":"IF(+'Card List'!$B6=\"\",\"\",+'Card List'!$B6)","v":"Arby's"},{"$f":"IF(+'Card List'!$C6=\"\",\"\",+'Card List'!$C6)","v":10},null,0,null,0,null,0,null,0,null,0,0,0]
[{"$f":"IF(+'Card List'!$B7=\"\",\"\",+'Card List'!$B7)","v":"Barnes & Noble"},{"$f":"IF(+'Card List'!$C7=\"\",\"\",+'Card List'!$C7)","v":10},null,0,null,0,null,0,null,0,null,0,0,0]
[{"$f":"IF(+'Card List'!$B8=\"\",\"\",+'Card List'!$B8)","v":"Bath & Body Works"},{"$f":"IF(+'Card List'!$C8=\"\",\"\",+'Card List'!$C8)","v":10},null,0,null,0,null,0,null,0,null,0,0,0]
[{"$f":"IF(+'Card List'!$B9=\"\",\"\",+'Card List'!$B9)","v":"Bed Bath & Beyond"},{"$f":"IF(+'Card List'!$C9=\"\",\"\",+'Card List'!$C9)","v":25},null,0,null,0,null,0,null,0,null,0,0,0]
[{"$f":"IF(+'Card List'!$B10=\"\",\"\",+'Card List'!$B10)","v":"Best Buy"},{"$f":"IF(+'Card List'!$C10=\"\",\"\",+'Card List'!$C10)","v":25},null,0,null,0,null,0,null,0,null,0,0,0]
[{"$f":"IF(+'Card List'!$B11=\"\",\"\",+'Card List'!$B11)","v":"BP Oil/Amoco"},{"$f":"IF(+'Card List'!$C11=\"\",\"\",+'Card List'!$C11)","v":50},null,0,null,0,null,0,null,0,null,0,0,0]
[{"$f":"IF(+'Card List'!$B12=\"\",\"\",+'Card List'!$B12)","v":"Buffalo Wild Wings"},{"$f":"IF(+'Card List'!$C12=\"\",\"\",+'Card List'!$C12)","v":25},null,0,null,0,null,0,null,0,null,0,0,0]
{"$rows_left_out":97}
{"sheet":"Monthly Inventory","index":5,"n_rows":108,"n_cols":14,"rows_kept":108,"cut":false,"hidden":false,"merged":[[96,0,96,1],[105,0,105,1],[107,0,107,1],[0,0,1,13],[2,0,3,0],[2,1,3,1],[2,2,2,3],[2,4,2,5],[2,6,2,7],[2,8,2,9],[2,10,2,11],[2,12,2,13]]}
["LCR Scrip Purchases for the Month and Year of:   ________________________"]
[]
["Retailer\n(Cards on hand)","Card Amount","Beginning of Month Inventory",null,"Monthly Sales (of cards kep on hand)",null,"Monthly Orders (of cards kept on hand)",null,"Ending of Month Inventory",null,"Count Validation",null,"Differences"]
[null,null,"# Cards","$","# Cards","$","# Cards","$","# Cards","$","# Cards","$","# Cards","$"]
[{"$f":"+'Monthly Sales'!A5","v":"Amazon"},{"$f":"+'Monthly Sales'!B5","v":25},null,{"$f":"IF(B5=\"\",\"\",IF(C5=\"\",0,+$B5*C5))","v":0},{"$f":"+IF(B5=\"\",\"\",'Monthly Sales'!M5)","v":0},{"$f":"IF(B5=\"\",\"\",IF(E5=\"\",0,+$B5*E5))","v":0},{"$f":"IF(B5=\"\",\"\",+'Monthly Orders'!M5)","v":0},{"$f":"IF(B5=\"\",\"\",IF(G5=\"\",0,+$B5*G5))","v":0},{"$f":"IF(B5=\"\",\"\",+C5-E5+G5)","v":0},{"$f":"IF(B5=\"\",\"\",IF(I5=\"\",0,+$B5*I5))","v":0},null,{"$f":"IF(B5=\"\",\"\",IF(K5=\"\",0,+$B5*K5))","v":0},{"$f":"IF(B5=\"\",\"\",+I5-K5)","v":0},{"$f":"IF(B5=\"\",\"\",+J5-L5)","v":0}]
[{"$f":"+'Monthly Sales'!A6","v":"American Eagle"},{"$f":"+'Monthly Sales'!B6","v":25},null,{"$f":"IF(B6=\"\",\"\",IF(C6=\"\",0,+$B6*C6))","v":0},{"$f":"+IF(B6=\"\",\"\",'Monthly Sales'!M6)","v":0},{"$f":"IF(B6=\"\",\"\",IF(E6=\"\",0,+$B6*E6))","v":0},{"$f":"IF(B6=\"\",\"\",+'Monthly Orders'!M6)","v":0},{"$f":"IF(B6=\"\",\"\",IF(G6=\"\",0,+$B6*G6))","v":0},{"$f":"IF(B6=\"\",\"\",+C6-E6+G6)","v":0},{"$f":"IF(B6=\"\",\"\",IF(I6=\"\",0,+$B6*I6))","v":0},null,{"$f":"IF(B6=\"\",\"\",IF(K6=\"\",0,+$B6*K6))","v":0},{"$f":"IF(B6=\"\",\"\",+I6-K6)","v":0},{"$f":"IF(B6=\"\",\"\",+J6-L6)","v":0}]
[{"$f":"+'Monthly Sales'!A7","v":"Apple iTunes"},{"$f":"+'Monthly Sales'!B7","v":15},null,0,{"$f":"+IF(B7=\"\",\"\",'Monthly Sales'!M7)","v":0},0,{"$f":"IF(B7=\"\",\"\",+'Monthly Orders'!M7)","v":0},0,0,0,null,0,0,0]
[{"$f":"+'Monthly Sales'!A8","v":"Applebee's"},{"$f":"+'Monthly Sales'!B8","v":25},null,0,{"$f":"+IF(B8=\"\",\"\",'Monthly Sales'!M8)","v":0},0,{"$f":"IF(B8=\"\",\"\",+'Monthly Orders'!M8)","v":0},0,0,0,null,0,0,0]
[{"$f":"+'Monthly Sales'!A9","v":"Arby's"},{"$f":"+'Monthly Sales'!B9","v":10},null,0,{"$f":"+IF(B9=\"\",\"\",'Monthly Sales'!M9)","v":0},0,{"$f":"IF(B9=\"\",\"\",+'Monthly Orders'!M9)","v":0},0,0,0,null,0,0,0]
[{"$f":"+'Monthly Sales'!A10","v":"Barnes & Noble"},{"$f":"+'Monthly Sales'!B10","v":10},null,0,{"$f":"+IF(B10=\"\",\"\",'Monthly Sales'!M10)","v":0},0,{"$f":"IF(B10=\"\",\"\",+'Monthly Orders'!M10)","v":0},0,0,0,null,0,0,0]
[{"$f":"+'Monthly Sales'!A11","v":"Bath & Body Works"},{"$f":"+'Monthly Sales'!B11","v":10},null,0,{"$f":"+IF(B11=\"\",\"\",'Monthly Sales'!M11)","v":0},0,{"$f":"IF(B11=\"\",\"\",+'Monthly Orders'!M11)","v":0},0,0,0,null,0,0,0]
[{"$f":"+'Monthly Sales'!A12","v":"Bed Bath & Beyond"},{"$f":"+'Monthly Sales'!B12","v":25},null,0,{"$f":"+IF(B12=\"\",\"\",'Monthly Sales'!M12)","v":0},0,{"$f":"IF(B12=\"\",\"\",+'Monthly Orders'!M12)","v":0},0,0,0,null,0,0,0]
[{"$f":"+'Monthly Sales'!A13","v":"Best Buy"},{"$f":"+'Monthly Sales'!B13","v":25},null,0,{"$f":"+IF(B13=\"\",\"\",'Monthly Sales'!M13)","v":0},0,{"$f":"IF(B13=\"\",\"\",+'Monthly Orders'!M13)","v":0},0,0,0,null,0,0,0]
[{"$f":"+'Monthly Sales'!A14","v":"BP Oil/Amoco"},{"$f":"+'Monthly Sales'!B14","v":50},null,0,{"$f":"+IF(B14=\"\",\"\",'Monthly Sales'!M14)","v":0},0,{"$f":"IF(B14=\"\",\"\",+'Monthly Orders'!M14)","v":0},0,0,0,null,0,0,0]
[{"$f":"+'Monthly Sales'!A15","v":"Buffalo Wild Wings"},{"$f":"+'Monthly Sales'!B15","v":25},null,0,{"$f":"+IF(B15=\"\",\"\",'Monthly Sales'!M15)","v":0},0,{"$f":"IF(B15=\"\",\"\",+'Monthly Orders'!M15)","v":0},0,0,0,null,0,0,0]
{"$rows_left_out":94}
{"sheet":"Formulas","index":6,"n_rows":5,"n_cols":15,"rows_kept":5,"cut":false,"hidden":false,"merged":[[0,1,0,9]]}
[null,"Individual Order Row formulas"]
[null,{"$f":"IF(+'Card List'!$A2=\"\",\"\",+'Card List'!$A2)","v":1},{"$f":"IF(+'Card List'!$B2=\"\",\"\",+'Card List'!$B2)","v":"Amazon"},{"$f":"IF(+'Card List'!$C2=\"\",\"\",+'Card List'!$C2)","v":25},{"$f":"IF('Card List'!$D2=\"\",\"\",'Card List'!$D2)","v":2.2499999999999999E-2},null,{"$f":"IF(+'Card List'!$A56=\"\",\"\",+'Card List'!$A56)","v":1},{"$f":"IF(+'Card List'!$B56=\"\",\"\",+'Card List'!$B56)","v":"Panda Express"},{"$f":"IF(+'Card List'!$C56=\"\",\"\",+'Card List'!$C56)","v":25},{"$f":"IF('Card List'!$D56=\"\",\"\",'Card List'!$D56)","v":0.08}]
[]
[null,"Monthy Sales and Orders Row formulas"]
[null,{"$f":"IF(+'Card List'!$B2=\"\",\"\",+'Card List'!$B2)","v":"Amazon"},{"$f":"IF(+'Card List'!$C2=\"\",\"\",+'Card List'!$C2)","v":25},null,{"$f":"IF(D5=\"\",0,+C5*D5)","v":0},null,{"$f":"IF(F5=\"\",0,+C5*F5)","v":0},null,{"$f":"IF(H5=\"\",0,+C5*H5)","v":0},null,{"$f":"IF(J5=\"\",0,+C5*J5)","v":0},null,{"$f":"IF(L5=\"\",0,+C5*L5)","v":0},{"$f":"+D5+F5+H5+J5+L5","v":0},{"$f":"+E5+G5+I5+K5+M5","v":0}]